program: Orca
programVersion: 5.0.2
elementType: Cl O O O O N N N C C C C C C C C C C C C C C C C C C C H H H H H H H H H H H H H H H H H H H H
charge: 0
multiplicity: 1
keywords: wb97x-d3
keywords: def2-TZVPP
keywords: def2/J RIJCOSX
keywords: DEFGRID2
keywords: scfconv7
keywords: smallprint printgap noloewdin
keywords: NOSOSCF
formula: C19H20ClN3O4
InChI: InChI=1/C19H20ClN3O4/c1-12-3-2-4-14(13-5-6-13)17(12)27-18-15(11-16(20)21-22-18)26-19(24)23-7-9-25-10-8-23/h2-4,11,13H,5-10H2,1H3
47 atoms
Cl -4.968465 0.296137 1.488075
O  0.008727 -0.811425 -1.001016
O  3.996975 3.051628 -0.601759
O  -0.563286 1.752358 -0.619184
O  -0.224438 2.472555 1.490793
N  1.224943 3.020052 -0.177354
N  -1.976145 -1.495426 -0.081206
N  -3.127944 -1.225687 0.496842
C  1.608646 -1.287383 1.198671
C  1.940771 -1.615622 2.619416
C  0.608555 -1.021883 2.29172
C  1.36022 -2.351936 0.189594
C  0.521818 -2.094101 -0.889911
C  1.944675 -3.610455 0.26145
C  0.236266 -3.024876 -1.8778
C  1.683119 -4.566451 -0.707038
C  0.839861 -4.273118 -1.765693
C  -0.699248 -2.701564 -3.002109
C  2.092087 3.815421 0.674344
C  1.762428 2.804075 -1.510978
C  3.481461 3.199461 0.696109
C  3.172764 2.241965 -1.399112
C  -1.16053 -0.532853 -0.417802
C  0.138454 2.426766 0.345545
C  -1.45941 0.824084 -0.20524
C  -2.646638 1.113283 0.399664
C  -3.450552 0.016188 0.727528
H  2.098581 -0.402235 0.801036
H  1.964322 -2.654875 2.920674
H  2.673916 -0.998664 3.121893
H  0.408603 0.006028 2.563901
H  -0.252506 -1.675757 2.346564
H  2.614725 -3.838869 1.079884
H  2.144923 -5.542567 -0.640126
H  0.637433 -5.024416 -2.518898
H  -0.436946 -1.766779 -3.498011
H  -1.723316 -2.605445 -2.63755
H  -0.689115 -3.489964 -3.752973
H  2.142046 4.83355 0.275238
H  1.676486 3.8670 1.677809
H  1.137052 2.119997 -2.07696
H  1.781813 3.760161 -2.043651
H  4.170114 3.840866 1.247902
H  3.437896 2.229135 1.213993
H  3.631229 2.186369 -2.387626
H  3.118915 1.218843 -0.996438
H  -2.950823 2.126023 0.619007
totalener: -1661.47559336 hartree
nucrepener: 2755.77480817 hartree
electener: -4417.25040153 hartree
oneelecener: -7751.36363604 hartree
twoeener: 3334.11323451 hartree
kineticenergy: 1655.84637676 hartree
xcener: -135.703091417854 hartree
chargesum: 0.0000000
charge: -0.047494 -0.302863 -0.310356 -0.331285 -0.402671 -0.127192 -0.081682 -0.186431 -0.048602 -0.149777 -0.151880 0.076891 0.147311 -0.157405 0.016263 -0.107228 -0.135923 -0.241139 -0.079333 -0.089975 0.011722 0.012621 0.225313 0.404006 0.124765 -0.095354 0.138482 0.054823 0.072645 0.076209 0.094603 0.087066 0.117808 0.122021 0.104072 0.096923 0.111291 0.083395 0.098431 0.107136 0.104539 0.098521 0.091797 0.073127 0.091812 0.079003 0.123996
qa: -0.0475 -0.3029 -0.3104 -0.3313 -0.4027 -0.1272 -0.0817 -0.1864 -0.0486 -0.1498 -0.1519 0.0769 0.1473 -0.1574 0.0163 -0.1072 -0.1359 -0.2411 -0.0793 -0.0900 0.0117 0.0126 0.2253 0.4040 0.1248 -0.0954 0.1385 0.0548 0.0726 0.0762 0.0946 0.0871 0.1178 0.1220 0.1041 0.0969 0.1113 0.0834 0.0984 0.1071 0.1045 0.0985 0.0918 0.0731 0.0918 0.0790 0.1240
va: 1.2488 2.1075 1.9954 2.0948 2.1044 3.1589 2.8884 2.9570 3.7834 3.9529 3.8785 3.6693 3.8144 3.9824 3.8284 3.9729 3.9736 3.8966 3.8550 3.8744 3.9702 3.9610 4.1143 4.2927 3.9345 4.0382 4.1649 1.0031 1.0256 1.0218 1.0345 1.0275 1.0088 1.0019 1.0103 0.9994 1.0035 1.0086 1.0053 1.0370 1.0313 1.0062 1.0022 1.0011 1.0040 1.0010 1.0204
dispcorr: -0.027267365 hartree
energy: -1661.502860723602
dipole: 32.90534 -31.64335 1.26199 -1.48414 2.50962 1.02548 -5.11785 4.30853 -0.80932
magnitude: 1.81638 au
magnitude: 4.61687 debye
