program: Orca
programVersion: 5.0.2
elementType: Cl O O O O N N N C C C C C C C C C C C C C C C C C C C H H H H H H H H H H H H H H H H H H H H
charge: 0
multiplicity: 1
keywords: wb97x-d3
keywords: def2-TZVPP
keywords: def2/J RIJCOSX
keywords: DEFGRID2
keywords: scfconv7
keywords: smallprint printgap noloewdin
keywords: NOSOSCF
formula: C19H20ClN3O4
InChI: InChI=1/C19H20ClN3O4/c1-12-3-2-4-14(13-5-6-13)17(12)27-18-15(11-16(20)21-22-18)26-19(24)23-7-9-25-10-8-23/h2-4,11,13H,5-10H2,1H3
47 atoms
Cl -4.954927 0.312244 1.508038
O  -0.007912 -0.838483 -1.018182
O  4.005299 3.023772 -0.542405
O  -0.541235 1.723421 -0.616285
O  -0.245214 2.518028 1.474552
N  1.223234 3.025726 -0.190145
N  -1.993854 -1.505765 -0.089458
N  -3.139091 -1.225842 0.497906
C  1.59627 -1.263069 1.192704
C  1.907291 -1.577054 2.621283
C  0.579246 -0.988852 2.2676
C  1.366471 -2.341359 0.193406
C  0.519262 -2.112895 -0.885918
C  1.979167 -3.585601 0.276629
C  0.243451 -3.064134 -1.857166
C  1.735044 -4.557943 -0.67997
C  0.876013 -4.296995 -1.734367
C  -0.712293 -2.778247 -2.974298
C  2.072953 3.85323 0.648343
C  1.793767 2.757397 -1.500488
C  3.456855 3.230736 0.733737
C  3.195977 2.190083 -1.32987
C  -1.169386 -0.550802 -0.424184
C  0.136107 2.436873 0.33711
C  -1.449005 0.808992 -0.199502
C  -2.629126 1.108557 0.414465
C  -3.444457 0.018185 0.73839
H  2.091059 -0.381578 0.792913
H  1.926998 -2.613991 2.930793
H  2.631108 -0.95493 3.130724
H  0.373627 0.04103 2.528305
H  -0.281399 -1.643782 2.317212
H  2.657864 -3.789023 1.094544
H  2.221306 -5.521547 -0.606237
H  0.684018 -5.062124 -2.476297
H  -0.463127 -1.85819 -3.503545
H  -1.72969 -2.67463 -2.593669
H  -0.712557 -3.589523 -3.700423
H  2.13934 4.85194 0.204856
H  1.632001 3.952422 1.637264
H  1.17792 2.05895 -2.059298
H  1.835674 3.694308 -2.064826
H  4.135484 3.891919 1.274686
H  3.392984 2.284185 1.292033
H  3.679925 2.093794 -2.302931
H  3.124162 1.183037 -0.890825
H  -2.921808 2.122295 0.643748
totalener: -1661.47545600 hartree
nucrepener: 2757.04449489 hartree
electener: -4418.51995090 hartree
oneelecener: -7753.87387454 hartree
twoeener: 3335.35392364 hartree
kineticenergy: 1655.84870881 hartree
xcener: -135.703872780323 hartree
chargesum: -0.0000000
charge: -0.047320 -0.302741 -0.310287 -0.328878 -0.402974 -0.128432 -0.084102 -0.183890 -0.051558 -0.150800 -0.153541 0.079500 0.146769 -0.158735 0.014632 -0.106910 -0.134951 -0.241103 -0.079896 -0.089477 0.012997 0.009097 0.227364 0.404066 0.119278 -0.090388 0.136114 0.055373 0.073503 0.076539 0.095523 0.086936 0.118279 0.122257 0.104006 0.096531 0.112143 0.082717 0.098538 0.107120 0.105121 0.098652 0.091767 0.073113 0.092278 0.081579 0.124190
qa: -0.0473 -0.3027 -0.3103 -0.3289 -0.4030 -0.1284 -0.0841 -0.1839 -0.0516 -0.1508 -0.1535 0.0795 0.1468 -0.1587 0.0146 -0.1069 -0.1350 -0.2411 -0.0799 -0.0895 0.0130 0.0091 0.2274 0.4041 0.1193 -0.0904 0.1361 0.0554 0.0735 0.0765 0.0955 0.0869 0.1183 0.1223 0.1040 0.0965 0.1121 0.0827 0.0985 0.1071 0.1051 0.0987 0.0918 0.0731 0.0923 0.0816 0.1242
va: 1.2491 2.1080 1.9953 2.0970 2.1033 3.1600 2.8909 2.9559 3.7817 3.9548 3.8791 3.6590 3.8149 3.9829 3.8274 3.9716 3.9706 3.8976 3.8566 3.8727 3.9678 3.9628 4.1110 4.2954 3.9370 4.0269 4.1682 1.0024 1.0255 1.0217 1.0346 1.0277 1.0083 1.0018 1.0104 0.9992 1.0041 1.0088 1.0053 1.0369 1.0314 1.0066 1.0021 1.0012 1.0044 0.9995 1.0215
dispcorr: -0.027390506 hartree
energy: -1661.502846509395
dipole: 32.85563 -31.56535 1.29028 -1.55428 2.57104 1.01676 -4.99954 4.20461 -0.79493
magnitude: 1.82498 au
magnitude: 4.63872 debye
