program: Orca
programVersion: 5.0.2
elementType: Cl O O O O N N N C C C C C C C C C C C C C C C C C C C H H H H H H H H H H H H H H H H H H H H
charge: 0
multiplicity: 1
keywords: wb97x-d3
keywords: def2-TZVPP
keywords: def2/J RIJCOSX
keywords: DEFGRID2
keywords: scfconv7
keywords: smallprint printgap noloewdin
keywords: NOSOSCF
formula: C19H20ClN3O4
InChI: InChI=1/C19H20ClN3O4/c1-12-3-2-4-14(13-5-6-13)17(12)27-18-15(11-16(20)21-22-18)26-19(24)23-7-9-25-10-8-23/h2-4,11,13H,5-10H2,1H3
47 atoms
Cl -4.613685 0.430593 1.866351
O  0.101002 -1.029718 -0.91312
O  3.941842 3.927119 -0.1371
O  -0.084546 1.460382 -0.322077
O  -0.805152 3.471102 0.429483
N  1.253853 3.218085 -0.502462
N  -1.90084 -1.555687 0.05498
N  -2.998121 -1.213124 0.704577
C  1.650624 -1.921267 1.196312
C  1.934064 -2.442121 2.569668
C  0.693148 -1.645976 2.323727
C  1.265118 -2.835402 0.087293
C  0.449545 -2.369608 -0.937892
C  1.700939 -4.152633 0.014779
C  0.035536 -3.15737 -2.002408
C  1.314436 -4.966898 -1.037486
C  0.489266 -4.471709 -2.033335
C  -0.879755 -2.617255 -3.058118
C  1.630311 4.611067 -0.342911
C  2.311341 2.39723 -1.070221
C  2.923473 4.693585 0.452854
C  3.578133 2.576353 -0.246897
C  -1.005181 -0.665718 -0.255558
C  0.048383 2.793722 -0.08032
C  -1.13096 0.706597 0.064318
C  -2.268976 1.074449 0.730247
C  -3.166869 0.037581 1.019835
H  2.252834 -1.071915 0.88648
H  1.815836 -3.501654 2.755945
H  2.74118 -1.987591 3.128619
H  0.634939 -0.637939 2.713817
H  -0.249233 -2.1780 2.32211
H  2.35291 -4.539527 0.78698
H  1.662438 -5.990205 -1.084435
H  0.183913 -5.11436 -2.849786
H  -1.869993 -2.416234 -2.645854
H  -1.000649 -3.333671 -3.869086
H  -0.507029 -1.687449 -3.488431
H  1.770716 5.058238 -1.332451
H  0.834758 5.154624 0.160732
H  2.026292 1.349366 -1.09689
H  2.491587 2.718239 -2.101576
H  3.276034 5.725161 0.490825
H  2.732866 4.364128 1.484925
H  4.408482 2.05424 -0.724848
H  3.426547 2.12859 0.747085
H  -2.477668 2.087518 1.028651
totalener: -1661.47590856 hartree
nucrepener: 2698.27152704 hartree
electener: -4359.74743560 hartree
oneelecener: -7636.18830314 hartree
twoeener: 3276.44086755 hartree
kineticenergy: 1655.84752464 hartree
xcener: -135.706426345454 hartree
chargesum: 0.0000000
charge: -0.047874 -0.302554 -0.311877 -0.292286 -0.414151 -0.138068 -0.071921 -0.200829 -0.052405 -0.151764 -0.151683 0.063656 0.154876 -0.152693 0.009536 -0.109130 -0.137299 -0.239191 -0.084969 -0.091237 0.017531 0.029811 0.153313 0.441691 0.186898 -0.161986 0.151660 0.075439 0.074442 0.077427 0.075719 0.093636 0.118129 0.122132 0.104383 0.110588 0.082730 0.097990 0.095935 0.108923 0.099492 0.095865 0.089434 0.072164 0.091721 0.063451 0.153345
qa: -0.0479 -0.3026 -0.3119 -0.2923 -0.4142 -0.1381 -0.0719 -0.2008 -0.0524 -0.1518 -0.1517 0.0637 0.1549 -0.1527 0.0095 -0.1091 -0.1373 -0.2392 -0.0850 -0.0912 0.0175 0.0298 0.1533 0.4417 0.1869 -0.1620 0.1517 0.0754 0.0744 0.0774 0.0757 0.0936 0.1181 0.1221 0.1044 0.1106 0.0827 0.0980 0.0959 0.1089 0.0995 0.0959 0.0894 0.0722 0.0917 0.0635 0.1533
va: 1.2491 2.1051 2.0023 2.1414 2.0926 3.1609 2.8543 2.9505 3.7812 3.9489 3.8895 3.6865 3.8226 3.9806 3.8324 3.9741 3.9752 3.9006 3.8671 3.8970 3.9619 3.9455 4.1738 4.2509 3.9241 3.9851 4.1522 1.0036 1.0260 1.0219 1.0217 1.0263 1.0082 1.0018 1.0102 1.0028 1.0088 0.9990 1.0055 1.0355 1.0290 1.0072 1.0007 1.0044 1.0006 1.0104 1.0348
dispcorr: -0.025042233 hartree
energy: -1661.500950791493
dipole: 31.01806 -29.31718 1.70088 -2.01220 2.75388 0.74169 -5.96653 5.44949 -0.51704
magnitude: 1.92624 au
magnitude: 4.89612 debye
