program: Orca
programVersion: 5.0.2
elementType: Cl O O O O N N N C C C C C C C C C C C C C C C C C C C H H H H H H H H H H H H H H H H H H H H
charge: 0
multiplicity: 1
keywords: wb97x-d3
keywords: def2-TZVPP
keywords: def2/J RIJCOSX
keywords: DEFGRID2
keywords: scfconv7
keywords: smallprint printgap noloewdin
keywords: NOSOSCF
formula: C19H20ClN3O4
InChI: InChI=1/C19H20ClN3O4/c1-12-3-2-4-14(13-5-6-13)17(12)27-18-15(11-16(20)21-22-18)26-19(24)23-7-9-25-10-8-23/h2-4,11,13H,5-10H2,1H3
47 atoms
Cl -4.885078 0.28312 1.0445
O  0.415549 -1.020392 -0.481605
O  3.454298 4.196868 -1.532277
O  0.043386 1.433915 0.252473
O  -1.029439 3.404571 -0.046139
N  1.241499 3.27301 -0.080217
N  -1.771479 -1.594824 -0.132718
N  -3.004099 -1.284964 0.220799
C  1.269972 -2.372905 1.789324
C  1.17902 -3.146151 3.06683
C  0.039982 -2.272536 2.650067
C  1.209432 -3.050059 0.465925
C  0.739545 -2.357548 -0.644547
C  1.622719 -4.363053 0.275025
C  0.650453 -2.915679 -1.911805
C  1.55014 -4.952865 -0.976476
C  1.069699 -4.233617 -2.057655
C  0.106937 -2.132516 -3.067832
C  1.440922 4.695698 -0.291098
C  2.475287 2.503177 -0.102026
C  2.244961 4.910783 -1.562408
C  3.237666 2.818877 -1.380083
C  -0.829829 -0.69589 -0.120472
C  -0.005233 2.779465 0.028912
C  -1.050865 0.646763 0.258104
C  -2.323457 0.976194 0.634605
C  -3.261755 -0.062989 0.58741
H  1.921914 -1.504957 1.816935
H  1.029075 -4.216831 3.017927
H  1.800571 -2.830154 3.894044
H  -0.134554 -1.35063 3.189571
H  -0.858736 -2.75819 2.293317
H  2.011396 -4.924212 1.114519
H  1.877095 -5.9753 -1.111211
H  1.013346 -4.699242 -3.03374
H  0.61727 -1.17704 -3.191861
H  -0.955807 -1.923106 -2.933508
H  0.21536 -2.689311 -3.997143
H  0.478323 5.197362 -0.355937
H  1.981175 5.109527 0.567001
H  3.079117 2.776342 0.769811
H  2.274109 1.437204 -0.046424
H  1.635634 4.614218 -2.428908
H  2.494131 5.966937 -1.674483
H  2.681077 2.412126 -2.23773
H  4.216015 2.336488 -1.357623
H  -2.607072 1.965699 0.952182
totalener: -1661.47657210 hartree
nucrepener: 2684.58246147 hartree
electener: -4346.05903356 hartree
oneelecener: -7608.93222978 hartree
twoeener: 3262.87319622 hartree
kineticenergy: 1655.84639377 hartree
xcener: -135.705395311281 hartree
chargesum: 0.0000000
charge: -0.048488 -0.301010 -0.311745 -0.309663 -0.409385 -0.141073 -0.072233 -0.201327 -0.051807 -0.150385 -0.151257 0.061905 0.162575 -0.153783 0.005958 -0.107859 -0.142268 -0.233557 -0.081847 -0.083247 0.015831 0.024289 0.169314 0.436265 0.178490 -0.134604 0.143457 0.081000 0.073236 0.077690 0.075304 0.093900 0.117829 0.122385 0.103727 0.097071 0.108122 0.083047 0.108697 0.096603 0.093132 0.098826 0.073708 0.088752 0.069483 0.090035 0.134903
qa: -0.0485 -0.3010 -0.3117 -0.3097 -0.4094 -0.1411 -0.0722 -0.2013 -0.0518 -0.1504 -0.1513 0.0619 0.1626 -0.1538 0.0060 -0.1079 -0.1423 -0.2336 -0.0818 -0.0832 0.0158 0.0243 0.1693 0.4363 0.1785 -0.1346 0.1435 0.0810 0.0732 0.0777 0.0753 0.0939 0.1178 0.1224 0.1037 0.0971 0.1081 0.0830 0.1087 0.0966 0.0931 0.0988 0.0737 0.0888 0.0695 0.0900 0.1349
va: 1.2479 2.1083 1.9992 2.1255 2.0971 3.1627 2.8481 2.9522 3.7778 3.9447 3.8935 3.7059 3.8115 3.9787 3.8432 3.9734 3.9844 3.9037 3.8606 3.9004 3.9676 3.9490 4.1309 4.2686 3.9227 4.0116 4.1653 1.0057 1.0257 1.0218 1.0209 1.0260 1.0090 1.0018 1.0104 0.9989 1.0015 1.0092 1.0356 1.0053 1.0056 1.0265 1.0038 1.0009 1.0080 1.0013 1.0364
dispcorr: -0.024476649 hartree
energy: -1661.501048744248
dipole: 30.49468 -28.74426 1.75042 -1.57705 2.34694 0.76990 -4.77073 4.79673 0.02600
magnitude: 1.91243 au
magnitude: 4.86102 debye
