program: Orca
programVersion: 5.0.2
elementType: Cl O O O O N N N C C C C C C C C C C C C C C C C C C C H H H H H H H H H H H H H H H H H H H H
charge: 0
multiplicity: 1
keywords: wb97x-d3
keywords: def2-TZVPP
keywords: def2/J RIJCOSX
keywords: DEFGRID2
keywords: scfconv7
keywords: smallprint printgap noloewdin
keywords: NOSOSCF
formula: C19H20ClN3O4
InChI: InChI=1/C19H20ClN3O4/c1-12-3-2-4-14(13-5-6-13)17(12)27-18-15(11-16(20)21-22-18)26-19(24)23-7-9-25-10-8-23/h2-4,11,13H,5-10H2,1H3
47 atoms
Cl -4.84687 0.327471 1.11418
O  0.424642 -1.011523 -0.477823
O  3.341356 4.178778 -1.689077
O  0.090712 1.430227 0.284415
O  -0.936386 3.446997 0.2365
N  1.320847 3.257975 0.022943
N  -1.762893 -1.569141 -0.109575
N  -2.989329 -1.251547 0.260149
C  1.298841 -2.365053 1.783723
C  1.213067 -3.134603 3.063751
C  0.079783 -2.248328 2.658018
C  1.216336 -3.044835 0.462809
C  0.737869 -2.351138 -0.643176
C  1.618556 -4.360828 0.269147
C  0.630102 -2.910295 -1.908446
C  1.526666 -4.952169 -0.980368
C  1.038097 -4.23148 -2.056972
C  0.080032 -2.123876 -3.059237
C  1.543636 4.682377 -0.15036
C  2.51738 2.459908 -0.194798
C  2.16832 4.931834 -1.514028
C  3.10507 2.801748 -1.556166
C  -0.812952 -0.679814 -0.096241
C  0.068708 2.789818 0.179941
C  -1.015631 0.661121 0.302044
C  -2.28164 0.998774 0.694004
C  -3.230402 -0.03136 0.642288
H  1.961173 -1.504794 1.801607
H  1.050238 -4.203538 3.018176
H  1.847257 -2.82457 3.883572
H  -0.076663 -1.323404 3.19784
H  -0.828776 -2.723837 2.312965
H  2.013922 -4.923186 1.104692
H  1.844914 -5.977071 -1.117242
H  0.966561 -4.698529 -3.031358
H  0.601769 -1.176028 -3.193811
H  -0.97758 -1.899379 -2.910213
H  0.167482 -2.685023 -3.988112
H  0.602874 5.219009 -0.053928
H  2.215785 5.032991 0.639399
H  3.240977 2.695577 0.592087
H  2.299121 1.397496 -0.138206
H  1.430748 4.697323 -2.295778
H  2.441219 5.983176 -1.616173
H  2.423248 2.441681 -2.34118
H  4.06197 2.294371 -1.687827
H  -2.553053 1.986677 1.025963
totalener: -1661.47630675 hartree
nucrepener: 2687.56629080 hartree
electener: -4349.04259755 hartree
oneelecener: -7614.88172211 hartree
twoeener: 3265.83912456 hartree
kineticenergy: 1655.84520805 hartree
xcener: -135.705281714213 hartree
chargesum: 0.0000000
charge: -0.048285 -0.301087 -0.312033 -0.305186 -0.410234 -0.145815 -0.070886 -0.202108 -0.052027 -0.150290 -0.152241 0.060851 0.163484 -0.152546 0.004328 -0.107816 -0.141163 -0.234645 -0.081946 -0.083188 0.016294 0.026246 0.159727 0.438649 0.185540 -0.143829 0.146863 0.081071 0.073360 0.077742 0.075754 0.094043 0.117864 0.122436 0.103812 0.096567 0.108044 0.083135 0.108736 0.095922 0.093484 0.099055 0.074590 0.088893 0.068658 0.089887 0.140290
qa: -0.0483 -0.3011 -0.3120 -0.3052 -0.4102 -0.1458 -0.0709 -0.2021 -0.0520 -0.1503 -0.1522 0.0609 0.1635 -0.1525 0.0043 -0.1078 -0.1412 -0.2346 -0.0819 -0.0832 0.0163 0.0262 0.1597 0.4386 0.1855 -0.1438 0.1469 0.0811 0.0734 0.0777 0.0758 0.0940 0.1179 0.1224 0.1038 0.0966 0.1080 0.0831 0.1087 0.0959 0.0935 0.0991 0.0746 0.0889 0.0687 0.0899 0.1403
va: 1.2483 2.1063 1.9988 2.1271 2.0958 3.1652 2.8468 2.9518 3.7772 3.9447 3.8938 3.7069 3.8119 3.9779 3.8426 3.9743 3.9834 3.9046 3.8633 3.8984 3.9643 3.9488 4.1456 4.2676 3.9199 4.0063 4.1604 1.0060 1.0257 1.0218 1.0210 1.0260 1.0089 1.0017 1.0104 0.9987 1.0018 1.0093 1.0355 1.0059 1.0062 1.0274 1.0032 1.0010 1.0077 1.0015 1.0366
dispcorr: -0.024582847 hartree
energy: -1661.500889594023
dipole: 30.18709 -28.42409 1.76301 -1.78074 2.52747 0.74673 -5.36851 5.33241 -0.03610
magnitude: 1.91497 au
magnitude: 4.86746 debye
