program: Orca
programVersion: 5.0.2
elementType: Cl O O O O N N N C C C C C C C C C C C C C C C C C C C H H H H H H H H H H H H H H H H H H H H
charge: 0
multiplicity: 1
keywords: wb97x-d3
keywords: def2-TZVPP
keywords: def2/J RIJCOSX
keywords: DEFGRID2
keywords: scfconv7
keywords: smallprint printgap noloewdin
keywords: NOSOSCF
formula: C19H20ClN3O4
InChI: InChI=1/C19H20ClN3O4/c1-12-3-2-4-14(13-5-6-13)17(12)27-18-15(11-16(20)21-22-18)26-19(24)23-7-9-25-10-8-23/h2-4,11,13H,5-10H2,1H3
47 atoms
Cl -4.697075 0.294329 1.618907
O  0.306476 -1.072591 -0.657276
O  3.765682 4.308226 -0.682724
O  -0.021875 1.424614 -0.176752
O  -0.935011 3.439587 0.307801
N  1.167856 3.261516 -0.538841
N  -1.769802 -1.643562 0.1117
N  -2.935349 -1.320764 0.64215
C  1.534331 -2.278041 1.521006
C  1.672655 -2.976519 2.83646
C  0.455274 -2.155184 2.56237
C  1.28022 -3.033951 0.265628
C  0.620979 -2.415401 -0.790568
C  1.688179 -4.349795 0.084222
C  0.333579 -3.051351 -1.989679
C  1.423499 -5.015519 -1.101533
C  0.751695 -4.370772 -2.126372
C  -0.410734 -2.345968 -3.082313
C  1.379113 4.6970 -0.606373
C  2.240948 2.480986 -1.13491
C  2.74872 5.033476 -0.041478
C  3.570654 2.925826 -0.546715
C  -0.871938 -0.733185 -0.12587
C  -0.013589 2.784479 -0.102335
C  -1.070742 0.642098 0.143182
C  -2.275383 0.986865 0.692995
C  -3.166928 -0.071567 0.918858
H  2.154245 -1.39582 1.39322
H  1.550859 -4.051234 2.870343
H  2.408144 -2.599303 3.53447
H  0.340936 -1.207096 3.071863
H  -0.473854 -2.678888 2.381197
H  2.223403 -4.853796 0.878101
H  1.7488 -6.039308 -1.229931
H  0.542976 -4.896815 -3.04967
H  -0.44619 -2.956829 -3.982859
H  0.051465 -1.394029 -3.34437
H  -1.440922 -2.140664 -2.785764
H  1.313345 5.026087 -1.649532
H  0.601445 5.21013 -0.04543
H  2.097321 1.418651 -0.958582
H  2.243992 2.641466 -2.219028
H  2.961691 6.092919 -0.190084
H  2.751701 4.837603 1.040945
H  4.388897 2.42862 -1.06968
H  3.615301 2.62629 0.511042
H  -2.541981 1.998465 0.946376
totalener: -1661.47676831 hartree
nucrepener: 2677.24163025 hartree
electener: -4338.71839856 hartree
oneelecener: -7594.22031887 hartree
twoeener: 3255.50192031 hartree
kineticenergy: 1655.84408337 hartree
xcener: -135.705577303994 hartree
chargesum: -0.0000000
charge: -0.048548 -0.298498 -0.310585 -0.292465 -0.412738 -0.136359 -0.070290 -0.204640 -0.057972 -0.148984 -0.152578 0.068754 0.160459 -0.158778 0.010159 -0.103666 -0.149195 -0.236713 -0.080999 -0.086151 0.014094 0.024288 0.147050 0.438560 0.196298 -0.167420 0.154801 0.079877 0.072655 0.076846 0.075159 0.096359 0.117118 0.122505 0.103995 0.083316 0.099539 0.107801 0.095190 0.109710 0.100277 0.092632 0.089156 0.070397 0.091017 0.067031 0.151535
qa: -0.0485 -0.2985 -0.3106 -0.2925 -0.4127 -0.1364 -0.0703 -0.2046 -0.0580 -0.1490 -0.1526 0.0688 0.1605 -0.1588 0.0102 -0.1037 -0.1492 -0.2367 -0.0810 -0.0862 0.0141 0.0243 0.1470 0.4386 0.1963 -0.1674 0.1548 0.0799 0.0727 0.0768 0.0752 0.0964 0.1171 0.1225 0.1040 0.0833 0.0995 0.1078 0.0952 0.1097 0.1003 0.0926 0.0892 0.0704 0.0910 0.0670 0.1515
va: 1.2484 2.1039 2.0009 2.1464 2.0936 3.1559 2.8393 2.9526 3.7785 3.9425 3.8933 3.6888 3.8223 3.9835 3.8394 3.9709 3.9883 3.9004 3.8671 3.9042 3.9688 3.9485 4.1565 4.2517 3.9377 3.9940 4.1484 1.0060 1.0258 1.0221 1.0206 1.0249 1.0094 1.0016 1.0105 1.0091 0.9985 1.0010 1.0065 1.0331 1.0256 1.0057 1.0003 1.0052 1.0003 1.0088 1.0358
dispcorr: -0.024231644 hartree
energy: -1661.500999953191
dipole: 30.67999 -28.99038 1.68961 -1.33064 2.12725 0.79660 -6.09855 5.63068 -0.46787
magnitude: 1.92568 au
magnitude: 4.89470 debye
