program: Orca
programVersion: 5.0.2
elementType: Cl S O O N N C C C C C C C C C C C C C C C C C C C H H H H H H H H H H H H H H H H H H H H H H H
charge: 0
multiplicity: 1
keywords: wb97x-d3
keywords: def2-TZVPP
keywords: def2/J RIJCOSX
keywords: DEFGRID2
keywords: scfconv7
keywords: smallprint printgap noloewdin
keywords: NOSOSCF
formula: C19H23ClN2O2S
InChI: InChI=1/C19H23ClN2O2S/c1-2-3-4-5-6-10-13-25-19(23)24-16-14-17(20)21-22-18(16)15-11-8-7-9-12-15/h7-9,11-12,14H,2-6,10,13H2,1H3
48 atoms
Cl -5.28113 -0.656371 1.277421
S  1.413532 -2.632864 0.400846
O  -0.506957 -1.208096 -0.35745
O  -0.204517 -1.135807 1.878901
N  -3.019428 1.241103 -1.136882
N  -4.028363 0.863619 -0.391903
C  4.920769 -0.1073 1.883878
C  4.021328 1.100234 1.617788
C  4.253108 -1.459158 1.643406
C  3.390147 1.110692 0.2299
C  3.011241 -1.689465 2.495366
C  2.537717 2.342507 -0.054095
C  2.171878 -2.870245 2.039421
C  1.287333 2.432932 0.809463
C  0.117811 -1.539385 0.801641
C  -1.695937 -0.542883 -0.327754
C  -1.864905 0.589981 -1.141153
C  -0.823675 1.145021 -2.027283
C  0.00174 0.332829 -2.804888
C  -0.701518 2.531947 -2.13108
C  -2.749007 -0.969788 0.439212
C  0.930574 0.899814 -3.666055
C  0.230349 3.093343 -2.988404
C  1.049377 2.278997 -3.759871
C  -3.90392 -0.205945 0.354013
H  5.285672 -0.057734 2.914411
H  5.80705 -0.041098 1.245879
H  4.614213 2.011656 1.745588
H  3.240149 1.15069 2.381059
H  4.972661 -2.258514 1.840662
H  3.997135 -1.547297 0.583838
H  2.765306 0.221494 0.091638
H  4.183431 1.03986 -0.521812
H  3.307066 -1.879405 3.531346
H  2.384969 -0.796348 2.525438
H  3.141072 3.246152 0.078505
H  2.241572 2.328764 -1.106177
H  2.782485 -3.767239 1.919238
H  1.382007 -3.114833 2.748818
H  1.526452 2.522794 1.870093
H  0.658877 1.547566 0.688326
H  0.682682 3.300489 0.541557
H  -0.093684 -0.743688 -2.776592
H  -1.329597 3.175952 -1.530307
H  -2.700089 -1.850043 1.064958
H  1.557229 0.257509 -4.270666
H  0.318693 4.169988 -3.050671
H  1.776746 2.718086 -4.429962
elementType: Cl S O N C H
totalener: -1856.32035366 hartree
nucrepener: 2560.10256607 hartree
electener: -4416.42291973 hartree
oneelecener: -7632.24061851 hartree
twoeener: 3215.81769878 hartree
cpcmener: -0.02860404 hartree
kineticenergy: 1850.59799549 hartree
xcener: -138.240031878436 hartree
chargesum: -0.0000000
charge: -0.047445 -0.046064 -0.280322 -0.411139 -0.150072 -0.207846 -0.163656 -0.128765 -0.129842 -0.103470 -0.156531 -0.098203 -0.117982 -0.282930 0.387113 0.217494 0.228579 0.034187 -0.191293 -0.188494 -0.127947 -0.172772 -0.172302 -0.111063 0.151095 0.074176 0.074747 0.075970 0.068677 0.087795 0.064271 0.029677 0.079870 0.093645 0.077923 0.065104 0.041734 0.130415 0.132560 0.103013 0.050973 0.099513 0.147614 0.139970 0.156834 0.158161 0.156373 0.160656
qa: -0.0474 -0.0461 -0.2803 -0.4111 -0.1501 -0.2078 -0.1637 -0.1288 -0.1298 -0.1035 -0.1565 -0.0982 -0.1180 -0.2829 0.3871 0.2175 0.2286 0.0342 -0.1913 -0.1885 -0.1279 -0.1728 -0.1723 -0.1111 0.1511 0.0742 0.0747 0.0760 0.0687 0.0878 0.0643 0.0297 0.0799 0.0936 0.0779 0.0651 0.0417 0.1304 0.1326 0.1030 0.0510 0.0995 0.1476 0.1400 0.1568 0.1582 0.1564 0.1607
va: 1.2562 2.4099 2.1343 2.0844 2.9343 2.9355 3.9386 3.8579 3.8519 3.8595 3.8688 3.8777 3.8934 3.9279 4.2084 3.8613 3.8242 3.5140 3.9134 3.9084 3.9951 3.9002 3.8899 3.8404 4.2201 1.0084 1.0076 1.0109 1.0014 1.0127 1.0103 1.0329 1.0132 1.0107 1.0140 1.0153 1.0272 1.0066 1.0178 1.0028 1.0058 1.0034 1.0139 1.0238 1.0095 0.9933 0.9951 0.9891
dispcorr: -0.028628254 hartree
energy: -1856.348981914685
dipole: 56.50561 -53.80636 2.69925 11.96657 -13.74124 -1.77467 6.40186 -6.12212 0.27974
magnitude: 3.24248 au
magnitude: 8.24173 debye
