program: Orca
programVersion: 5.0.2
elementType: Cl S O O N N C C C C C C C C C C C C C C C C C C C H H H H H H H H H H H H H H H H H H H H H H H
charge: 0
multiplicity: 1
keywords: wb97x-d3
keywords: def2-TZVPP
keywords: def2/J RIJCOSX
keywords: DEFGRID2
keywords: scfconv7
keywords: smallprint printgap noloewdin
keywords: NOSOSCF
formula: C19H23ClN2O2S
InChI: InChI=1/C19H23ClN2O2S/c1-2-3-4-5-6-10-13-25-19(23)24-16-14-17(20)21-22-18(16)15-11-8-7-9-12-15/h7-9,11-12,14H,2-6,10,13H2,1H3
48 atoms
Cl -6.345284 -1.571004 -0.570658
S  0.970126 -2.733677 0.266004
O  -1.312681 -2.008504 -0.496129
O  -0.87021 -1.376432 1.618449
N  -3.44167 0.907655 -0.645125
N  -4.635628 0.361578 -0.624946
C  3.914504 0.790113 1.278074
C  4.854577 1.310105 0.200375
C  3.400437 -0.61577 1.002788
C  5.307043 2.742282 0.447825
C  2.381086 -1.066241 2.037309
C  6.261492 3.269819 -0.614457
C  1.858624 -2.477452 1.83299
C  6.709398 4.698422 -0.346995
C  -0.529513 -1.920704 0.608948
C  -2.43605 -1.227993 -0.530036
C  -2.344331 0.170195 -0.612508
C  -1.056604 0.887832 -0.644544
C  -0.038166 0.502029 -1.515225
C  -0.864635 1.987413 0.190863
C  -3.667881 -1.816933 -0.513139
C  1.154525 1.209942 -1.547352
C  0.330977 2.687726 0.158938
C  1.341879 2.301946 -0.711771
C  -4.74693 -0.941784 -0.575731
H  3.061212 1.470625 1.370291
H  4.422821 0.81066 2.247873
H  4.356222 1.250812 -0.773913
H  5.730261 0.655604 0.132099
H  4.238422 -1.320229 0.98041
H  2.949586 -0.64246 0.005622
H  5.787511 2.807194 1.430296
H  4.427588 3.394386 0.498703
H  2.835619 -1.043776 3.032519
H  1.550325 -0.357781 2.068537
H  7.137418 2.616312 -0.670799
H  5.778694 3.2144 -1.594905
H  2.682531 -3.192198 1.783707
H  1.210654 -2.795596 2.649115
H  5.858402 5.38154 -0.3160
H  7.390678 5.058463 -1.119066
H  7.227485 4.778066 0.610706
H  -0.179175 -0.329574 -2.192792
H  -1.647762 2.287815 0.874496
H  -3.790948 -2.889359 -0.445706
H  1.935864 0.909888 -2.23298
H  0.473672 3.536422 0.8145
H  2.273589 2.852542 -0.738874
elementType: Cl S O N C H
totalener: -1856.32432031 hartree
nucrepener: 2474.57644209 hartree
electener: -4330.90076240 hartree
oneelecener: -7461.21229699 hartree
twoeener: 3130.31153459 hartree
cpcmener: -0.02950992 hartree
kineticenergy: 1850.61786943 hartree
xcener: -138.237333884985 hartree
chargesum: -0.0000000
charge: -0.045524 -0.042721 -0.288225 -0.401958 -0.148602 -0.201394 -0.133997 -0.137617 -0.140506 -0.118959 -0.126282 -0.078723 -0.131352 -0.283951 0.364138 0.166116 0.254822 0.033420 -0.174784 -0.169892 -0.125089 -0.209392 -0.186755 -0.115666 0.151547 0.060416 0.086527 0.057789 0.074991 0.086883 0.052701 0.069478 0.054660 0.090661 0.073483 0.055428 0.054626 0.130741 0.134379 0.078186 0.090038 0.077859 0.158864 0.144142 0.157110 0.162069 0.157936 0.182378
qa: -0.0455 -0.0427 -0.2882 -0.4020 -0.1486 -0.2014 -0.1340 -0.1376 -0.1405 -0.1190 -0.1263 -0.0787 -0.1314 -0.2840 0.3641 0.1661 0.2548 0.0334 -0.1748 -0.1699 -0.1251 -0.2094 -0.1868 -0.1157 0.1515 0.0604 0.0865 0.0578 0.0750 0.0869 0.0527 0.0695 0.0547 0.0907 0.0735 0.0554 0.0546 0.1307 0.1344 0.0782 0.0900 0.0779 0.1589 0.1441 0.1571 0.1621 0.1579 0.1824
va: 1.2579 2.4098 2.1131 2.0966 2.9499 2.9358 3.8644 3.8752 3.8509 3.8602 3.8535 3.8712 3.8985 3.9482 4.2676 3.8703 3.8216 3.5408 3.8626 3.9691 4.0476 3.8699 3.9346 3.7949 4.2131 1.0080 1.0106 1.0076 1.0132 1.0132 1.0220 1.0097 1.0084 1.0104 1.0190 1.0074 1.0065 1.0075 1.0175 1.0004 1.0043 1.0005 1.0073 1.0160 1.0045 0.9948 0.9955 0.9686
dispcorr: -0.026582865 hartree
energy: -1856.350903174939
dipole: 79.62339 -76.90189 2.72150 28.89307 -30.49298 -1.59991 8.73089 -8.54999 0.18090
magnitude: 3.16212 au
magnitude: 8.03746 debye
