program: Orca
programVersion: 5.0.2
elementType: Cl S O O N N C C C C C C C C C C C C C C C C C C C H H H H H H H H H H H H H H H H H H H H H H H
charge: 0
multiplicity: 1
keywords: wb97x-d3
keywords: def2-TZVPP
keywords: def2/J RIJCOSX
keywords: DEFGRID2
keywords: scfconv7
keywords: smallprint printgap noloewdin
keywords: NOSOSCF
formula: C19H23ClN2O2S
InChI: InChI=1/C19H23ClN2O2S/c1-2-3-4-5-6-10-13-25-19(23)24-16-14-17(20)21-22-18(16)15-11-8-7-9-12-15/h7-9,11-12,14H,2-6,10,13H2,1H3
48 atoms
Cl -6.228208 -0.878495 0.329335
S  0.894338 -3.05417 0.030557
O  -1.378316 -2.063122 -0.369046
O  -0.28204 -1.053517 1.320813
N  -3.124401 1.088505 -0.707208
N  -4.346443 0.741991 -0.377936
C  4.980026 0.213444 1.101518
C  4.218008 1.530817 1.018838
C  4.138955 -0.964618 1.585221
C  5.10365 2.698166 0.598901
C  2.98762 -1.317394 0.648289
C  4.343969 3.994374 0.332305
C  2.245953 -2.551167 1.135748
C  3.574145 4.521461 1.535022
C  -0.31703 -1.879754 0.457206
C  -2.371631 -1.124087 -0.358638
C  -2.13537 0.210789 -0.72655
C  -0.81046 0.719401 -1.125932
C  -0.348286 1.916203 -0.579338
C  -0.020435 0.038634 -2.050986
C  -3.638387 -1.506567 -0.020221
C  0.888838 2.41961 -0.946493
C  1.216824 0.548803 -2.417584
C  1.674651 1.736941 -1.866314
C  -4.598685 -0.503053 -0.064495
H  5.832597 0.336403 1.776432
H  5.403036 -0.023625 0.119509
H  3.757778 1.73766 1.990399
H  3.392524 1.438818 0.306917
H  3.742237 -0.745216 2.581701
H  4.784513 -1.840364 1.699112
H  5.649383 2.420095 -0.308339
H  5.864676 2.872341 1.367413
H  2.294738 -0.477609 0.570172
H  3.374366 -1.50057 -0.357729
H  5.053404 4.757084 0.000177
H  3.653784 3.842531 -0.503808
H  2.906945 -3.419093 1.160249
H  1.846552 -2.425092 2.142448
H  4.232494 4.660276 2.39545
H  2.775694 3.844059 1.840639
H  3.113487 5.485985 1.317162
H  -0.952969 2.44629 0.144738
H  -0.373966 -0.874984 -2.510982
H  -3.873281 -2.520747 0.271589
H  1.243401 3.343978 -0.508657
H  1.82048 0.016748 -3.140452
H  2.641767 2.131248 -2.150379
elementType: Cl S O N C H
totalener: -1856.32269317 hartree
nucrepener: 2501.66732722 hartree
electener: -4357.99002040 hartree
oneelecener: -7515.47512195 hartree
twoeener: 3157.48510156 hartree
cpcmener: -0.02949488 hartree
kineticenergy: 1850.61432195 hartree
xcener: -138.238431492283 hartree
chargesum: -0.0000000
charge: -0.045795 -0.040144 -0.284101 -0.397324 -0.145376 -0.204899 -0.127598 -0.060239 -0.148173 -0.128610 -0.106132 -0.126925 -0.108557 -0.284585 0.353954 0.171252 0.251093 0.007032 -0.174062 -0.152034 -0.131240 -0.165001 -0.205745 -0.112816 0.152891 0.072491 0.064788 0.073856 -0.005445 0.071419 0.080280 0.066532 0.066702 0.048544 0.077895 0.075821 0.054632 0.133292 0.118552 0.088232 0.078185 0.095237 0.142773 0.162262 0.156609 0.168636 0.157331 0.164509
qa: -0.0458 -0.0401 -0.2841 -0.3973 -0.1454 -0.2049 -0.1276 -0.0602 -0.1482 -0.1286 -0.1061 -0.1269 -0.1086 -0.2846 0.3540 0.1713 0.2511 0.0070 -0.1741 -0.1520 -0.1312 -0.1650 -0.2057 -0.1128 0.1529 0.0725 0.0648 0.0739 -0.0054 0.0714 0.0803 0.0665 0.0667 0.0485 0.0779 0.0758 0.0546 0.1333 0.1186 0.0882 0.0782 0.0952 0.1428 0.1623 0.1566 0.1686 0.1573 0.1645
va: 1.2575 2.4193 2.1203 2.0980 2.9472 2.9378 3.9140 3.8429 3.9414 3.8805 3.8667 3.8987 3.8885 3.9186 4.2769 3.8833 3.8254 3.5627 3.9998 3.8396 4.0392 3.8720 3.9232 3.8014 4.2123 1.0113 1.0096 1.0063 1.0286 1.0092 1.0108 1.0095 1.0095 1.0183 1.0132 1.0117 1.0084 1.0089 1.0219 1.0024 0.9981 1.0036 1.0188 1.0046 1.0053 0.9846 0.9957 0.9886
dispcorr: -0.027273188 hartree
energy: -1856.349966361727
dipole: 72.27870 -69.78659 2.49211 25.10920 -27.02311 -1.91391 9.02977 -9.08300 -0.05323
magnitude: 3.14268 au
magnitude: 7.98807 debye
