program: Orca
programVersion: 5.0.2
elementType: Cl S O O N N C C C C C C C C C C C C C C C C C C C H H H H H H H H H H H H H H H H H H H H H H H
charge: 0
multiplicity: 1
keywords: wb97x-d3
keywords: def2-TZVPP
keywords: def2/J RIJCOSX
keywords: DEFGRID2
keywords: scfconv7
keywords: smallprint printgap noloewdin
keywords: NOSOSCF
formula: C19H23ClN2O2S
InChI: InChI=1/C19H23ClN2O2S/c1-2-3-4-5-6-10-13-25-19(23)24-16-14-17(20)21-22-18(16)15-11-8-7-9-12-15/h7-9,11-12,14H,2-6,10,13H2,1H3
48 atoms
Cl -6.311291 -1.918519 -0.799359
S  0.894218 -2.112365 1.078606
O  -1.317913 -1.815831 -0.078466
O  -1.14227 -0.561961 1.78298
N  -3.604031 0.742541 -1.218002
N  -4.75021 0.103269 -1.178555
C  3.694107 1.690054 1.221619
C  4.749643 1.915996 0.145467
C  3.216196 0.248045 1.340706
C  6.078047 1.221913 0.420894
C  2.058284 0.118922 2.318779
C  7.152893 1.560781 -0.603702
C  1.590783 -1.306801 2.553127
C  8.486318 0.893357 -0.304343
C  -0.668155 -1.349931 1.01781
C  -2.475029 -1.181355 -0.438838
C  -2.47052 0.15146 -0.878768
C  -1.243011 0.963721 -0.965727
C  -0.094061 0.468363 -1.581121
C  -1.238208 2.25675 -0.444746
C  -3.654952 -1.867461 -0.398163
C  1.041847 1.25931 -1.674055
C  -0.099136 3.041124 -0.535843
C  1.042333 2.545185 -1.152161
C  -4.775042 -1.149979 -0.801321
H  2.830173 2.327787 1.010931
H  4.085491 2.023204 2.188873
H  4.927943 2.991548 0.047958
H  4.357369 1.58581 -0.823377
H  4.036024 -0.40017 1.664469
H  2.90866 -0.112312 0.353117
H  5.938916 0.13652 0.446738
H  6.430474 1.505633 1.419137
H  2.361167 0.512488 3.293985
H  1.223441 0.741167 1.985698
H  6.810389 1.265647 -1.600239
H  7.288106 2.646088 -0.639437
H  2.42699 -1.94867 2.836617
H  0.855335 -1.370759 3.354496
H  8.869458 1.195616 0.672287
H  9.242123 1.152495 -1.046908
H  8.39353 -0.194385 -0.29657
H  -0.087252 -0.520754 -2.019716
H  -2.12295 2.645867 0.041981
H  -3.711525 -2.894622 -0.065172
H  1.925238 0.871237 -2.163672
H  -0.103256 4.04226 -0.125729
H  1.929333 3.160562 -1.227532
elementType: Cl S O N C H
totalener: -1856.32346494 hartree
nucrepener: 2464.53494678 hartree
electener: -4320.85841172 hartree
oneelecener: -7441.13230169 hartree
twoeener: 3120.27388998 hartree
cpcmener: -0.02948701 hartree
kineticenergy: 1850.62001669 hartree
xcener: -138.238178067336 hartree
chargesum: 0.0000000
charge: -0.045771 -0.042650 -0.287366 -0.401534 -0.148271 -0.201746 -0.152195 -0.136929 -0.144301 -0.102500 -0.129833 -0.084987 -0.124167 -0.278917 0.363621 0.168342 0.258221 0.034420 -0.183106 -0.183252 -0.126743 -0.189338 -0.163430 -0.141242 0.151442 0.080346 0.084019 0.072776 0.058669 0.089306 0.058483 0.059139 0.056450 0.091426 0.068094 0.054686 0.053651 0.129829 0.133424 0.077368 0.089518 0.077118 0.159869 0.143122 0.157645 0.163663 0.159417 0.174213
qa: -0.0458 -0.0427 -0.2874 -0.4015 -0.1483 -0.2017 -0.1522 -0.1369 -0.1443 -0.1025 -0.1298 -0.0850 -0.1242 -0.2789 0.3636 0.1683 0.2582 0.0344 -0.1831 -0.1833 -0.1267 -0.1893 -0.1634 -0.1412 0.1514 0.0803 0.0840 0.0728 0.0587 0.0893 0.0585 0.0591 0.0565 0.0914 0.0681 0.0547 0.0537 0.1298 0.1334 0.0774 0.0895 0.0771 0.1599 0.1431 0.1576 0.1637 0.1594 0.1742
va: 1.2577 2.4114 2.1150 2.0970 2.9504 2.9370 3.8853 3.8985 3.8326 3.8647 3.8631 3.8841 3.8917 3.9460 4.2687 3.8717 3.8186 3.5354 3.8720 3.9852 4.0431 3.8508 3.9300 3.8276 4.2128 1.0081 1.0106 1.0120 1.0102 1.0103 1.0182 1.0084 1.0083 1.0101 1.0197 1.0060 1.0084 1.0088 1.0189 1.0008 1.0044 1.0011 1.0076 1.0170 1.0045 0.9935 0.9931 0.9813
dispcorr: -0.026204320 hartree
energy: -1856.349669259929
dipole: 84.23767 -81.47702 2.76065 22.78201 -23.96770 -1.18569 9.77593 -8.92316 0.85277
magnitude: 3.12318 au
magnitude: 7.93849 debye
