program: Orca
programVersion: 5.0.2
elementType: Cl S O O N N C C C C C C C C C C C C C C C C C C C H H H H H H H H H H H H H H H H H H H H H H H
charge: 0
multiplicity: 1
keywords: wb97x-d3
keywords: def2-TZVPP
keywords: def2/J RIJCOSX
keywords: DEFGRID2
keywords: scfconv7
keywords: smallprint printgap noloewdin
keywords: NOSOSCF
formula: C19H23ClN2O2S
InChI: InChI=1/C19H23ClN2O2S/c1-2-3-4-5-6-10-13-25-19(23)24-16-14-17(20)21-22-18(16)15-11-8-7-9-12-15/h7-9,11-12,14H,2-6,10,13H2,1H3
48 atoms
Cl -6.138561 -0.894969 1.081089
S  0.365327 2.131677 -0.994128
O  -1.868108 1.013912 -0.795734
O  -0.199476 -0.250474 0.039862
N  -3.558357 -2.117598 -1.454727
N  -4.595975 -2.022272 -0.656233
C  4.207109 1.502786 2.66574
C  5.637931 1.062258 2.946061
C  3.808422 1.331148 1.206485
C  6.044519 1.238769 4.40287
C  2.375478 1.769035 0.926702
C  7.47509 0.801522 4.689828
C  2.038564 1.592701 -0.542538
C  7.868986 0.9934 6.146508
C  -0.572194 0.757849 -0.483291
C  -2.771243 -0.009545 -0.731252
C  -2.654372 -1.155742 -1.534481
C  -1.532372 -1.369755 -2.466588
C  -0.847722 -2.583468 -2.43997
C  -1.140928 -0.380662 -3.367243
C  -3.844948 0.109972 0.105173
C  0.22638 -2.797381 -3.288707
C  -0.066585 -0.601008 -4.217035
C  0.622611 -1.804789 -4.175552
C  -4.742983 -0.950203 0.080411
H  4.087152 2.552431 2.954013
H  3.519971 0.932533 3.299708
H  6.32338 1.629094 2.306695
H  5.75613 0.011579 2.659889
H  3.929415 0.282449 0.916304
H  4.492575 1.904814 0.572639
H  5.358498 0.67242 5.042224
H  5.924586 2.289752 4.687826
H  1.685882 1.189434 1.544636
H  2.246639 2.817611 1.206291
H  7.595327 -0.2502 4.41277
H  8.161162 1.363384 4.04876
H  2.689104 2.211987 -1.163311
H  2.168767 0.562527 -0.875671
H  7.221468 0.418438 6.8113
H  7.792778 2.041585 6.442103
H  8.895509 0.674563 6.331745
H  -1.143335 -3.353655 -1.73981
H  -1.681818 0.554981 -3.425865
H  -3.980021 0.970402 0.745853
H  0.758904 -3.738433 -3.253088
H  0.230464 0.171682 -4.913447
H  1.466054 -1.969718 -4.83288
elementType: Cl S O N C H
totalener: -1856.32396048 hartree
nucrepener: 2341.20356480 hartree
electener: -4197.52752528 hartree
oneelecener: -7194.62008229 hartree
twoeener: 2997.09255701 hartree
cpcmener: -0.02972797 hartree
kineticenergy: 1850.61714714 hartree
xcener: -138.233780213481 hartree
chargesum: 0.0000000
charge: -0.045702 -0.039933 -0.283310 -0.401939 -0.145789 -0.202586 -0.111199 -0.107598 -0.117151 -0.110194 -0.147826 -0.078303 -0.095730 -0.283181 0.354924 0.184391 0.246005 0.020365 -0.186612 -0.178174 -0.134114 -0.173718 -0.179243 -0.122435 0.152929 0.059836 0.060423 0.056899 0.057615 0.068222 0.066612 0.055745 0.055660 0.081425 0.073673 0.053996 0.053585 0.132057 0.115716 0.077596 0.077450 0.090176 0.143653 0.163751 0.156933 0.161027 0.160393 0.163679
qa: -0.0457 -0.0399 -0.2833 -0.4019 -0.1458 -0.2026 -0.1112 -0.1076 -0.1172 -0.1102 -0.1478 -0.0783 -0.0957 -0.2832 0.3549 0.1844 0.2460 0.0204 -0.1866 -0.1782 -0.1341 -0.1737 -0.1792 -0.1224 0.1529 0.0598 0.0604 0.0569 0.0576 0.0682 0.0666 0.0557 0.0557 0.0814 0.0737 0.0540 0.0536 0.1321 0.1157 0.0776 0.0774 0.0902 0.1437 0.1638 0.1569 0.1610 0.1604 0.1637
va: 1.2574 2.4254 2.1185 2.0923 2.9472 2.9371 3.8890 3.8885 3.8981 3.8815 3.8903 3.8758 3.8748 3.9474 4.2810 3.8645 3.8366 3.5633 3.9767 3.8673 4.0411 3.9350 3.9085 3.8741 4.2118 1.0099 1.0100 1.0102 1.0102 1.0101 1.0095 1.0086 1.0084 1.0211 1.0184 1.0071 1.0072 1.0087 1.0211 1.0006 1.0006 1.0042 1.0166 1.0057 1.0056 0.9915 0.9928 0.9875
dispcorr: -0.021725896 hartree
energy: -1856.345686376701
dipole: 86.66185 -84.37285 2.28900 14.26104 -12.01179 2.24925 30.35643 -30.47271 -0.11628
magnitude: 3.21126 au
magnitude: 8.16237 debye
