program: Orca
programVersion: 5.0.2
elementType: Cl S O O N N C C C C C C C C C C C C C C C C C C C H H H H H H H H H H H H H H H H H H H H H H H
charge: 0
multiplicity: 1
keywords: wb97x-d3
keywords: def2-TZVPP
keywords: def2/J RIJCOSX
keywords: DEFGRID2
keywords: scfconv7
keywords: smallprint printgap noloewdin
keywords: NOSOSCF
formula: C19H23ClN2O2S
InChI: InChI=1/C19H23ClN2O2S/c1-2-3-4-5-6-10-13-25-19(23)24-16-14-17(20)21-22-18(16)15-11-8-7-9-12-15/h7-9,11-12,14H,2-6,10,13H2,1H3
48 atoms
Cl -5.386764 0.127337 1.434123
S  1.109425 -3.152328 -0.007321
O  -1.081377 -1.961011 -0.18472
O  0.26815 -1.017855 1.348562
N  -2.546726 1.274248 -0.844016
N  -3.653216 1.209706 -0.143288
C  3.683744 0.105881 1.553991
C  3.427637 1.610089 1.611936
C  3.425804 -0.529023 0.189783
C  1.949659 1.980848 1.589476
C  3.67043 -2.035051 0.186537
C  1.671532 3.468854 1.782604
C  2.641841 -2.874791 0.933144
C  2.260032 4.362346 0.698564
C  0.074449 -1.857892 0.519901
C  -1.943381 -0.898906 -0.144171
C  -1.683355 0.271083 -0.876404
C  -0.4640 0.477232 -1.678907
C  0.157281 1.726609 -1.654361
C  0.070996 -0.532187 -2.481145
C  -3.090047 -0.987163 0.591828
C  1.300714 1.955709 -2.402707
C  1.2160 -0.297618 -3.227332
C  1.83733 0.942529 -3.185487
C  -3.919889 0.126581 0.541649
H  3.079709 -0.385576 2.323647
H  4.726046 -0.089978 1.823474
H  3.953928 2.094737 0.783409
H  3.874447 2.009402 2.528268
H  4.101148 -0.072204 -0.539077
H  2.416886 -0.305952 -0.17004
H  1.439119 1.426245 2.38287
H  1.497629 1.652545 0.649576
H  3.747216 -2.402009 -0.839505
H  4.641926 -2.235165 0.649079
H  0.589152 3.620152 1.81932
H  2.053604 3.784311 2.758811
H  3.026192 -3.881768 1.096532
H  2.387162 -2.475206 1.914378
H  1.918108 4.060054 -0.293943
H  3.350406 4.334267 0.691493
H  1.964194 5.402659 0.842613
H  -0.24727 2.517022 -1.035308
H  -0.417683 -1.493481 -2.559644
H  -3.329403 -1.864678 1.176789
H  1.777735 2.926312 -2.367057
H  1.617167 -1.087273 -3.848631
H  2.733576 1.120783 -3.764866
elementType: Cl S O N C H
totalener: -1856.31907696 hartree
nucrepener: 2594.57025247 hartree
electener: -4450.88932943 hartree
oneelecener: -7701.83744032 hartree
twoeener: 3250.94811089 hartree
cpcmener: -0.02913956 hartree
kineticenergy: 1850.60651639 hartree
xcener: -138.238770263300 hartree
chargesum: 0.0000000
charge: -0.044827 -0.036161 -0.291077 -0.407489 -0.149356 -0.201950 -0.152018 -0.125637 -0.047610 -0.066584 -0.140611 -0.126327 -0.118950 -0.274226 0.359143 0.148236 0.250556 0.062161 -0.184441 -0.209010 -0.106773 -0.157708 -0.154004 -0.145496 0.149871 0.066294 0.079071 0.062751 0.075343 0.088777 -0.030363 0.072862 0.000403 0.086174 0.083068 0.070044 0.059867 0.140082 0.114983 0.068076 0.083938 0.094465 0.151072 0.159708 0.155988 0.167543 0.158853 0.161291
qa: -0.0448 -0.0362 -0.2911 -0.4075 -0.1494 -0.2020 -0.1520 -0.1256 -0.0476 -0.0666 -0.1406 -0.1263 -0.1190 -0.2742 0.3591 0.1482 0.2506 0.0622 -0.1844 -0.2090 -0.1068 -0.1577 -0.1540 -0.1455 0.1499 0.0663 0.0791 0.0628 0.0753 0.0888 -0.0304 0.0729 0.0004 0.0862 0.0831 0.0700 0.0599 0.1401 0.1150 0.0681 0.0839 0.0945 0.1511 0.1597 0.1560 0.1675 0.1589 0.1613
va: 1.2592 2.4187 2.1048 2.0841 2.9506 2.9385 3.9253 3.8852 3.8641 3.8546 3.9199 3.9083 3.8647 3.9322 4.2715 3.8894 3.8393 3.5222 3.9246 3.8973 4.0439 3.8563 3.8572 3.8842 4.2112 1.0117 1.0121 1.0071 1.0086 1.0121 1.0245 1.0205 1.0216 1.0134 1.0096 1.0055 1.0095 1.0047 1.0223 1.0015 0.9974 1.0069 1.0160 1.0097 1.0039 0.9854 0.9934 0.9896
dispcorr: -0.029947374 hartree
energy: -1856.349024338336
dipole: 55.35128 -53.12124 2.23004 17.73126 -19.96772 -2.23646 3.95084 -4.05522 -0.10438
magnitude: 3.16002 au
magnitude: 8.03214 debye
