program: Orca
programVersion: 5.0.2
elementType: Cl S O O N N C C C C C C C C C C C C C C C C C C C H H H H H H H H H H H H H H H H H H H H H H H
charge: 0
multiplicity: 1
keywords: wb97x-d3
keywords: def2-TZVPP
keywords: def2/J RIJCOSX
keywords: DEFGRID2
keywords: scfconv7
keywords: smallprint printgap noloewdin
keywords: NOSOSCF
formula: C19H23ClN2O2S
InChI: InChI=1/C19H23ClN2O2S/c1-2-3-4-5-6-10-13-25-19(23)24-16-14-17(20)21-22-18(16)15-11-8-7-9-12-15/h7-9,11-12,14H,2-6,10,13H2,1H3
48 atoms
Cl -5.760677 -0.087443 1.00892
S  0.970702 -3.079877 0.532727
O  -1.164431 -1.876939 0.002316
O  0.296421 -0.576997 1.122151
N  -2.767783 1.229672 -0.95907
N  -3.938049 1.099987 -0.382168
C  4.297514 0.245859 1.343386
C  3.970902 1.315701 0.306843
C  4.6257 -1.107443 0.713543
C  3.507504 2.650194 0.882846
C  3.409882 -1.816464 0.116969
C  2.192068 2.578433 1.65101
C  2.551538 -2.470868 1.189665
C  1.66228 3.951017 2.034499
C  0.016548 -1.622976 0.614748
C  -2.079955 -0.867165 -0.116514
C  -1.835462 0.293379 -0.868534
C  -0.569258 0.56782 -1.571416
C  0.062448 -0.406343 -2.343059
C  -0.006312 1.84077 -1.480975
C  -3.296807 -1.025188 0.485803
C  1.246495 -0.110652 -3.003117
C  1.176192 2.130704 -2.141767
C  1.807643 1.154554 -2.901377
C  -4.199919 0.013347 0.299721
H  3.466307 0.131802 2.045618
H  5.149744 0.580529 1.942186
H  3.196325 0.951262 -0.374531
H  4.857829 1.481356 -0.31295
H  5.093166 -1.761009 1.456163
H  5.372942 -0.964049 -0.072079
H  3.39135 3.360582 0.057472
H  4.285366 3.067559 1.531907
H  2.810868 -1.108529 -0.460645
H  3.732237 -2.585739 -0.587299
H  1.44627 2.060972 1.040123
H  2.316114 1.974152 2.553235
H  3.045069 -3.354533 1.596785
H  2.341067 -1.810718 2.030466
H  2.380554 4.497813 2.648563
H  0.734161 3.877681 2.602987
H  1.459053 4.557046 1.149456
H  -0.374635 -1.389731 -2.457634
H  -0.486386 2.601839 -0.880174
H  -3.532847 -1.900405 1.075562
H  1.727164 -0.871912 -3.602802
H  1.609814 3.118354 -2.055173
H  2.734706 1.379964 -3.411757
elementType: Cl S O N C H
totalener: -1856.32064310 hartree
nucrepener: 2568.53545368 hartree
electener: -4424.85609678 hartree
oneelecener: -7649.59620002 hartree
twoeener: 3224.74010324 hartree
cpcmener: -0.02921134 hartree
kineticenergy: 1850.60956431 hartree
xcener: -138.238713078357 hartree
chargesum: -0.0000000
charge: -0.045539 -0.043610 -0.283747 -0.404366 -0.147424 -0.204779 -0.152571 -0.034253 -0.151738 -0.164182 -0.081638 -0.068972 -0.124497 -0.293412 0.368640 0.179651 0.250521 0.018561 -0.160321 -0.176456 -0.126944 -0.202218 -0.205144 -0.077500 0.154505 0.066135 0.077727 -0.014069 0.079030 0.082245 0.076442 0.071544 0.075667 0.014901 0.099934 0.028641 0.069729 0.135205 0.119071 0.082869 0.090699 0.078790 0.162072 0.145597 0.154277 0.158586 0.159854 0.162483
qa: -0.0455 -0.0436 -0.2837 -0.4044 -0.1474 -0.2048 -0.1526 -0.0343 -0.1517 -0.1642 -0.0816 -0.0690 -0.1245 -0.2934 0.3686 0.1797 0.2505 0.0186 -0.1603 -0.1765 -0.1269 -0.2022 -0.2051 -0.0775 0.1545 0.0661 0.0777 -0.0141 0.0790 0.0822 0.0764 0.0715 0.0757 0.0149 0.0999 0.0286 0.0697 0.1352 0.1191 0.0829 0.0907 0.0788 0.1621 0.1456 0.1543 0.1586 0.1599 0.1625
va: 1.2581 2.4200 2.1215 2.0917 2.9448 2.9368 3.9090 3.8485 3.9501 3.9002 3.8850 3.8494 3.8741 3.9582 4.2508 3.8695 3.8117 3.5441 3.8388 3.8821 4.0412 3.8889 3.8790 3.7744 4.2108 1.0048 1.0119 1.0341 1.0121 1.0055 1.0092 1.0061 1.0094 1.0164 1.0154 1.0143 1.0085 1.0084 1.0237 1.0011 1.0030 1.0009 1.0057 1.0175 1.0066 0.9934 0.9925 0.9878
dispcorr: -0.029123436 hartree
energy: -1856.349766537735
dipole: 60.95743 -58.69268 2.26475 17.10870 -19.26718 -2.15847 5.57708 -5.35099 0.22609
magnitude: 3.13675 au
magnitude: 7.97298 debye
