program: Orca
programVersion: 5.0.2
elementType: Cl S O O N N C C C C C C C C C C C C C C C C C C C H H H H H H H H H H H H H H H H H H H H H H H
charge: 0
multiplicity: 1
keywords: wb97x-d3
keywords: def2-TZVPP
keywords: def2/J RIJCOSX
keywords: DEFGRID2
keywords: scfconv7
keywords: smallprint printgap noloewdin
keywords: NOSOSCF
formula: C19H23ClN2O2S
InChI: InChI=1/C19H23ClN2O2S/c1-2-3-4-5-6-10-13-25-19(23)24-16-14-17(20)21-22-18(16)15-11-8-7-9-12-15/h7-9,11-12,14H,2-6,10,13H2,1H3
48 atoms
Cl -6.132568 -1.993733 -1.334493
S  0.291608 -1.252988 2.394015
O  -1.856207 -0.927432 1.119754
O  -0.243634 -1.888445 -0.124877
N  -3.112072 0.225346 -2.072184
N  -4.253498 -0.41993 -2.148105
C  4.802695 0.054019 -0.105948
C  5.314712 1.111907 0.865515
C  4.025685 -1.073498 0.570235
C  6.056441 2.248298 0.173101
C  2.651618 -0.635808 1.065743
C  6.697867 3.246981 1.133201
C  1.943386 -1.748782 1.817641
C  5.70388 3.972021 2.029477
C  -0.607574 -1.419378 0.913187
C  -2.661485 -0.765095 0.026197
C  -2.314328 0.09843 -1.025448
C  -1.056642 0.870211 -1.044975
C  -0.235598 0.808858 -2.169487
C  -0.672338 1.65117 0.043795
C  -3.849583 -1.437439 -0.027996
C  0.96131 1.507276 -2.198567
C  0.522092 2.356731 0.005731
C  1.343834 2.281068 -1.110091
C  -4.615081 -1.204075 -1.164431
H  5.654207 -0.371934 -0.644733
H  4.169223 0.525739 -0.865949
H  5.981052 0.633992 1.592604
H  4.479597 1.519369 1.441537
H  4.614122 -1.468567 1.405197
H  3.898078 -1.902173 -0.131907
H  5.36521 2.777603 -0.492429
H  6.835469 1.827604 -0.470837
H  2.739235 0.232308 1.72265
H  2.05001 -0.320077 0.209812
H  7.43538 2.727797 1.75325
H  7.258372 3.984767 0.552912
H  1.848737 -2.659654 1.226364
H  2.483027 -2.011611 2.728946
H  4.933865 4.474285 1.439905
H  6.200517 4.731669 2.634864
H  5.199053 3.292505 2.717289
H  -0.523894 0.197052 -3.014459
H  -1.309832 1.730216 0.915024
H  -4.162604 -2.114617 0.755122
H  1.597696 1.443211 -3.071195
H  0.811653 2.964054 0.852873
H  2.281676 2.821177 -1.131163
elementType: Cl S O N C H
totalener: -1856.32207416 hartree
nucrepener: 2463.51909527 hartree
electener: -4319.84116943 hartree
oneelecener: -7439.04637609 hartree
twoeener: 3119.20520667 hartree
cpcmener: -0.02961058 hartree
kineticenergy: 1850.59924375 hartree
xcener: -138.233897838927 hartree
chargesum: 0.0000000
charge: -0.046485 -0.040973 -0.284779 -0.395614 -0.146537 -0.203545 -0.122196 -0.133685 -0.137534 -0.119132 -0.111262 -0.106369 -0.108792 -0.283083 0.355766 0.177415 0.251119 0.020406 -0.178051 -0.165817 -0.132836 -0.156525 -0.179795 -0.147964 0.153759 0.081618 0.055351 0.063981 0.070795 0.069247 0.084965 0.062637 0.066832 0.081315 0.033328 0.055117 0.069069 0.117583 0.134039 0.080061 0.093170 0.080188 0.144874 0.158925 0.157169 0.158462 0.157927 0.165859
qa: -0.0465 -0.0410 -0.2848 -0.3956 -0.1465 -0.2035 -0.1222 -0.1337 -0.1375 -0.1191 -0.1113 -0.1064 -0.1088 -0.2831 0.3558 0.1774 0.2511 0.0204 -0.1781 -0.1658 -0.1328 -0.1565 -0.1798 -0.1480 0.1538 0.0816 0.0554 0.0640 0.0708 0.0692 0.0850 0.0626 0.0668 0.0813 0.0333 0.0551 0.0691 0.1176 0.1340 0.0801 0.0932 0.0802 0.1449 0.1589 0.1572 0.1585 0.1579 0.1659
va: 1.2564 2.4164 2.1223 2.1007 2.9461 2.9369 3.9022 3.8597 3.9249 3.8793 3.8771 3.8892 3.8969 3.9290 4.2753 3.8710 3.8200 3.5444 3.9686 3.8612 4.0429 3.8960 3.8682 3.8219 4.2127 1.0116 1.0113 1.0106 0.9976 1.0086 1.0086 1.0096 1.0126 1.0118 1.0275 1.0086 1.0079 1.0256 1.0082 1.0003 1.0049 0.9974 1.0146 1.0065 1.0053 0.9931 0.9947 0.9867
dispcorr: -0.025976447 hartree
energy: -1856.348050602224
dipole: 81.77043 -79.65491 2.11553 25.63237 -25.84754 -0.21517 13.30167 -10.97821 2.32346
magnitude: 3.14964 au
magnitude: 8.00575 debye
