program: Gaussian 09
title: 000059740
version: EM64L-G09RevD.01
frameworkgroup: C1[X(C13H8N2O6)]
method: RPBEPBE
basis: SDD
operation: Freq
keyword: #p
keyword: freq=noraman
keyword: PBEPBE/SDD
title: #p freq=noraman PBEPBE/SDD
converged: YES YES NO NO
title: Mulliken charges:
elementType: O O O O O O N N C C C C C C C C C C C C C H H H H H H H H
charge: -0.194650 -0.273169 -0.187930 -0.174646 -0.208424 -0.182768 0.018112 0.048612 0.392524 0.116525 0.295007 0.147684 0.067535 -0.369841 -0.429001 -0.363137 -0.410093 0.233009 -0.356834 0.265891 -0.512905 0.285403 0.247676 0.274923 0.295706 0.258105 0.254220 0.215198 0.247269
chargesum: 0.00000
title: Mulliken charges with hydrogens summed into heavy atoms:
elementType: O O O O O O N N C C C C C C C C C C C C C
charge: -0.194650 -0.273169 -0.187930 -0.174646 -0.208424 -0.182768 0.018112 0.048612 0.392524 0.116525 0.295007 0.147684 0.067535 -0.084438 -0.181325 -0.088214 -0.114387 0.233009 -0.098729 0.265891 0.203782
polarizability: 3.59111968e+02 3.97488832e+00 1.97710840e+02 -2.23420050e+00 9.08066310e-01 8.09528562e+01
1716.lowfreq: -7.7177 0.0002 0.0008 0.0009 3.2482 4.6327 39.2296 42.8534 56.5220
frequency: 39.2231 42.8511 56.5165 71.1001 84.2392 105.1936 119.8164 141.1314 159.6235 176.8623 189.4326 235.6070 254.1913 266.5070 289.5715 338.1621 366.9289 399.0541 406.6888 438.1922 459.9639 513.9245 523.2798 554.8061 563.6525 584.9776 609.4315 639.9891 655.9841 677.8398 682.7315 709.1980 732.2566 749.0582 784.2114 795.5568 824.0471 833.7899 858.1225 877.5100 900.7722 912.5649 965.0221 967.7905 989.9769 1021.5340 1088.6609 1106.6436 1114.6521 1146.9306 1157.8552 1177.1281 1207.4069 1219.7118 1227.7875 1251.6484 1268.1761 1278.6244 1354.1220 1358.2279 1373.2395 1381.7406 1409.4783 1426.2604 1448.3458 1455.4799 1461.9521 1473.8606 1515.7538 1533.3204 1579.8461 1587.4877 1626.1815 2978.5925 3080.3203 3139.3033 3146.1182 3169.7316 3175.3271 3192.7458 3249.0882
redmass: 3.2383 9.2157 8.7772 8.2730 5.6011 8.8041 6.4116 1.1411 5.0092 11.3576 5.2032 8.6015 6.6334 6.4360 6.0373 9.1106 7.2982 6.9126 5.5895 7.8353 5.3848 6.8643 4.7168 6.3560 5.2542 6.3246 4.7975 4.9968 7.4183 7.0210 8.6232 9.7604 4.4823 10.9996 3.9689 6.8686 1.7394 1.6983 6.0212 1.4789 5.0064 7.7010 1.3501 1.3726 5.4876 5.0139 2.3085 1.2718 4.4248 1.3374 1.2849 1.8770 6.5151 5.2148 2.2310 4.4894 2.3424 4.0483 6.6253 9.1999 4.6814 6.1281 3.8651 1.4704 2.3753 1.0629 4.9576 1.0546 6.4188 5.6225 6.8249 9.0798 7.4514 1.0316 1.1037 1.1023 1.0880 1.0973 1.0887 1.0980 1.0992
irintensity: 7.6212 3.6616 1.3907 0.1344 1.3997 5.8598 1.2589 2.1958 1.0894 1.3355 2.8417 1.0410 3.8845 4.7724 4.8791 1.0036 2.1360 10.0875 5.3789 1.4844 3.0117 2.5369 4.2551 0.7694 3.4320 12.0449 8.4006 12.7746 6.9828 5.4081 10.1139 12.1157 6.2085 28.1817 6.1275 6.6701 34.6050 36.1896 7.5964 28.4030 15.4929 11.7359 1.0703 0.1420 5.2183 156.9616 2.8440 3.5410 31.8389 5.8936 3.7700 119.2230 410.4639 112.3873 30.5756 236.1191 11.9351 120.3869 29.3660 171.0172 14.3667 71.4891 2.3763 39.8546 40.6034 11.4767 33.5564 18.3294 16.5483 147.4629 73.5673 11.5292 17.5867 59.0659 26.3754 20.9780 2.3575 5.4072 3.9644 0.5239 4.2488
temp: 298.150 k
press: 1.00000 atm
elementType: 8 8 8 8 8 8 7 7 6 6 6 6 6 6 6 6 6 6 6 6 6 1 1 1 1 1 1 1 1
symmnumber: 1
zpe: 507998.0 jmol-1
zpe.correction: 0.193486 hartree
zpe.thermalcorrener: 0.210956 hartree
zpe.thermalcorrenthalpy: 0.211900 hartree
zpe.thermalcorrgfe: 0.146858 hartree
zpe.sumelectzpe: -1059.356131 hartree
zpe.sumelectthermal: -1059.338661 hartree
zpe.sumelectthermalent: -1059.337717 hartree
zpe.sumelectthermalfe: -1059.402759 hartree
dipole: -4.0283 -3.9317 1.0577
dipole: 5.7275
quadrupole: -162.8564 -109.3654 -121.6448
quadrupole: 19.4930 -6.2120 0.0182
quadrupole: -31.5675 21.9235 9.6441 19.4930 -6.2120 0.0182
hfenergy: -1059.5496172 hartree
pointgroup: C01 [X(C13H8N2O6)]
dipole: 1.5996483 -1.4990071 -0.5213756 debye
polarizability: 358.9790604|-1.0930931|197.4523219|-8.1493035|4.5874414|81.3442821 unknown
InChI: InChI=1S/C13H8N2O6/c1-20-11-5-2-7-8(13(11)15(18)19)3-4-10-9(7)6-12(21-10)14(16)17/h2-6H,1H3
charge 0 multiplicity 1
29 atoms
O  -3.213284 1.123964 -0.033481
O  4.2516 -1.151994 0.254491
O  3.24428 2.430251 0.794304
O  4.221355 1.389125 -0.984508
O  -5.345045 -1.764677 -0.028255
O  -5.849947 0.479893 -0.073513
N  3.339807 1.455158 -0.046649
N  -5.019532 -0.507025 -0.041752
C  0.063493 -0.526192 0.051352
C  -1.351354 -0.262857 0.024331
C  0.953165 0.618757 0.054415
C  -1.807103 1.079463 -0.006246
C  2.363662 0.344494 0.047427
C  0.415065 1.96167 0.025398
C  0.598272 -1.849195 0.076124
C  -0.958907 2.20733 -0.009748
C  -2.528037 -1.094866 0.014742
C  2.878558 -0.964573 0.089532
C  1.975965 -2.068453 0.103775
C  -3.608232 -0.22512 -0.019246
C  4.97191 -1.828495 -0.847275
H  1.103725 2.808937 0.05042
H  -0.08631 -2.703369 0.091714
H  -1.363799 3.221635 -0.029646
H  -2.603622 -2.178908 0.030561
H  2.384115 -3.081523 0.171139
H  5.008192 -1.156379 -1.722631
H  4.492279 -2.789158 -1.114427
H  5.985227 -2.008992 -0.461651
