program: Orca
programVersion: 5.0.2
elementType: Cl S O O N N C C C C C C C C C C C C C C C C C C C H H H H H H H H H H H H H H H H H H H H H H H
charge: 0
multiplicity: 1
keywords: wb97x-d3
keywords: def2-TZVPP
keywords: def2/J RIJCOSX
keywords: DEFGRID2
keywords: scfconv7
keywords: smallprint printgap noloewdin
keywords: NOSOSCF
formula: C19H23ClN2O2S
InChI: InChI=1/C19H23ClN2O2S/c1-2-3-4-5-6-10-13-25-19(23)24-16-14-17(20)21-22-18(16)15-11-8-7-9-12-15/h7-9,11-12,14H,2-6,10,13H2,1H3
48 atoms
Cl -6.393291 -1.671299 -0.753885
S  0.55652 -1.794146 1.91884
O  -1.689767 -1.160366 0.990179
O  -0.381171 -2.178618 -0.535316
N  -3.316762 0.273154 -1.906208
N  -4.51402 -0.257566 -1.818104
C  4.353572 0.687627 0.624252
C  4.892601 1.735635 1.589293
C  3.381583 -0.269994 1.299559
C  5.920759 2.673081 0.970632
C  2.845014 -1.352219 0.372997
C  6.487244 3.673765 1.970139
C  2.053616 -2.426129 1.100939
C  7.523073 4.605124 1.359967
C  -0.544959 -1.757506 0.571753
C  -2.637738 -0.863643 0.051106
C  -2.378522 0.019328 -1.008983
C  -1.07727 0.685581 -1.201479
C  -0.47719 0.65888 -2.458757
C  -0.442832 1.348038 -0.151367
C  -3.881761 -1.415993 0.169703
C  0.744542 1.28059 -2.661456
C  0.777584 1.973951 -0.360746
C  1.375427 1.937179 -1.612911
C  -4.79239 -1.051552 -0.814818
H  5.188689 0.118649 0.202029
H  3.862348 1.181147 -0.220955
H  5.343207 1.229438 2.44991
H  4.058411 2.323187 1.988004
H  2.548867 0.300807 1.722196
H  3.886048 -0.746253 2.147292
H  5.468826 3.212092 0.131216
H  6.740949 2.08406 0.546268
H  2.240592 -0.911466 -0.424662
H  3.680618 -1.859423 -0.119105
H  5.669832 4.263706 2.395457
H  6.934736 3.129958 2.807426
H  1.769079 -3.249087 0.44653
H  2.644038 -2.854279 1.912978
H  7.916576 5.306108 2.096953
H  7.098511 5.191715 0.543413
H  8.368811 4.045841 0.955732
H  -0.9588 0.137765 -3.275725
H  -0.906808 1.402077 0.824993
H  -4.132087 -2.0996 0.969317
H  1.20634 1.24838 -3.639249
H  1.260741 2.49164 0.457519
H  2.329289 2.422681 -1.772241
elementType: Cl S O N C H
totalener: -1856.32412274 hartree
nucrepener: 2444.09258407 hartree
electener: -4300.41670681 hartree
oneelecener: -7400.20502753 hartree
twoeener: 3099.78832072 hartree
cpcmener: -0.02979701 hartree
kineticenergy: 1850.61678383 hartree
xcener: -138.236461725309 hartree
chargesum: -0.0000000
charge: -0.045857 -0.045808 -0.285282 -0.397694 -0.147009 -0.203506 -0.137407 -0.099409 -0.137851 -0.115913 -0.120228 -0.077490 -0.127829 -0.284774 0.365037 0.181998 0.250396 0.024584 -0.186263 -0.167981 -0.134561 -0.159451 -0.195755 -0.130485 0.153344 0.072778 0.058457 0.060045 0.058992 0.061352 0.084726 0.058597 0.055254 0.061525 0.088836 0.054373 0.053991 0.131409 0.131408 0.090199 0.078269 0.077753 0.143089 0.159821 0.156954 0.159444 0.161020 0.166904
qa: -0.0459 -0.0458 -0.2853 -0.3977 -0.1470 -0.2035 -0.1374 -0.0994 -0.1379 -0.1159 -0.1202 -0.0775 -0.1278 -0.2848 0.3650 0.1820 0.2504 0.0246 -0.1863 -0.1680 -0.1346 -0.1595 -0.1958 -0.1305 0.1533 0.0728 0.0585 0.0600 0.0590 0.0614 0.0847 0.0586 0.0553 0.0615 0.0888 0.0544 0.0540 0.1314 0.1314 0.0902 0.0783 0.0778 0.1431 0.1598 0.1570 0.1594 0.1610 0.1669
va: 1.2575 2.4059 2.1200 2.1013 2.9475 2.9371 3.8928 3.8638 3.8473 3.8913 3.8698 3.8722 3.8869 3.9488 4.2659 3.8636 3.8192 3.5420 3.9822 3.8556 4.0420 3.9242 3.8672 3.8346 4.2133 1.0142 1.0146 1.0108 1.0102 1.0167 1.0111 1.0081 1.0089 1.0208 1.0122 1.0068 1.0071 1.0228 1.0082 1.0040 1.0005 1.0005 1.0166 1.0075 1.0053 0.9922 0.9926 0.9863
dispcorr: -0.025465864 hartree
energy: -1856.349588604721
dipole: 84.50637 -82.13030 2.37607 28.62305 -29.14931 -0.52626 13.22878 -11.19591 2.03288
magnitude: 3.17100 au
magnitude: 8.06003 debye
