program: Orca
programVersion: 5.0.2
elementType: Cl S O O N N C C C C C C C C C C C C C C C C C C C H H H H H H H H H H H H H H H H H H H H H H H
charge: 0
multiplicity: 1
keywords: wb97x-d3
keywords: def2-TZVPP
keywords: def2/J RIJCOSX
keywords: DEFGRID2
keywords: scfconv7
keywords: smallprint printgap noloewdin
keywords: NOSOSCF
formula: C19H23ClN2O2S
InChI: InChI=1/C19H23ClN2O2S/c1-2-3-4-5-6-10-13-25-19(23)24-16-14-17(20)21-22-18(16)15-11-8-7-9-12-15/h7-9,11-12,14H,2-6,10,13H2,1H3
48 atoms
Cl -6.419929 -1.472215 -0.366033
S  0.886545 -2.788265 0.361829
O  -1.411345 -2.073917 -0.375141
O  -0.72173 -0.993003 1.475679
N  -3.450331 0.862099 -0.925049
N  -4.658518 0.369226 -0.779134
C  3.993394 1.343852 1.616761
C  4.766981 1.399435 0.304137
C  3.548146 -0.059518 2.021548
C  5.1753 2.810768 -0.111449
C  2.541263 -0.670572 1.05443
C  6.102651 3.536892 0.86041
C  2.033004 -2.016302 1.542499
C  7.422445 2.81793 1.099162
C  -0.519801 -1.790222 0.6072
C  -2.503052 -1.259937 -0.496787
C  -2.374078 0.102169 -0.810573
C  -1.069871 0.763921 -1.00681
C  -0.789323 1.942836 -0.318261
C  -0.120755 0.238196 -1.881926
C  -3.751146 -1.794493 -0.347225
C  0.425264 2.585285 -0.500765
C  1.08915 0.891168 -2.069713
C  1.366191 2.062354 -1.37866
C  -4.805272 -0.905074 -0.517576
H  3.113326 1.993681 1.545606
H  4.60822 1.755117 2.422152
H  4.16123 0.973649 -0.500695
H  5.651533 0.758396 0.378887
H  3.102039 -0.016444 3.019529
H  4.42256 -0.713123 2.105017
H  4.270776 3.411251 -0.256052
H  5.662286 2.761304 -1.090536
H  1.704682 0.021364 0.929375
H  2.989947 -0.800457 0.06767
H  6.305465 4.535527 0.464157
H  5.596016 3.696359 1.816274
H  2.849697 -2.735057 1.631354
H  1.550602 -1.954496 2.518315
H  7.951292 2.638965 0.160363
H  7.279754 1.850815 1.583921
H  8.081924 3.404837 1.73999
H  -1.516521 2.35178 0.371339
H  -0.331344 -0.664542 -2.441393
H  -3.902963 -2.837002 -0.103195
H  0.637712 3.495899 0.043773
H  1.815366 0.482528 -2.759766
H  2.313086 2.567309 -1.521327
elementType: Cl S O N C H
totalener: -1856.32157884 hartree
nucrepener: 2478.54819258 hartree
electener: -4334.86977142 hartree
oneelecener: -7469.11052355 hartree
twoeener: 3134.24075213 hartree
cpcmener: -0.02951643 hartree
kineticenergy: 1850.60511451 hartree
xcener: -138.237104923754 hartree
chargesum: -0.0000000
charge: -0.045873 -0.041275 -0.283953 -0.395525 -0.147015 -0.202270 -0.129628 -0.149123 -0.145582 -0.154048 -0.111284 -0.117610 -0.114632 -0.275807 0.355756 0.176451 0.253104 0.018022 -0.161510 -0.165571 -0.132850 -0.183256 -0.186017 -0.137857 0.153759 0.066365 0.085711 0.075429 0.084492 0.079456 0.073299 0.066168 0.078995 0.047826 0.078612 0.071233 0.061789 0.131647 0.119718 0.082037 0.078671 0.092468 0.143521 0.156927 0.156542 0.157050 0.157371 0.178264
qa: -0.0459 -0.0413 -0.2840 -0.3955 -0.1470 -0.2023 -0.1296 -0.1491 -0.1456 -0.1540 -0.1113 -0.1176 -0.1146 -0.2758 0.3558 0.1765 0.2531 0.0180 -0.1615 -0.1656 -0.1328 -0.1833 -0.1860 -0.1379 0.1538 0.0664 0.0857 0.0754 0.0845 0.0795 0.0733 0.0662 0.0790 0.0478 0.0786 0.0712 0.0618 0.1316 0.1197 0.0820 0.0787 0.0925 0.1435 0.1569 0.1565 0.1571 0.1574 0.1783
va: 1.2574 2.4134 2.1220 2.1031 2.9489 2.9357 3.8561 3.8479 3.9338 3.8899 3.8614 3.8888 3.9122 3.9270 4.2734 3.8751 3.8146 3.5414 3.9598 3.8582 4.0438 3.9101 3.8848 3.8050 4.2119 1.0123 1.0116 1.0095 1.0047 1.0091 1.0092 1.0144 1.0048 1.0240 1.0124 1.0080 1.0024 1.0083 1.0236 1.0008 0.9981 1.0049 1.0146 1.0069 1.0054 0.9958 0.9956 0.9743
dispcorr: -0.027347996 hartree
energy: -1856.348926836380
dipole: 81.84741 -79.17016 2.67725 27.44002 -28.94817 -1.50815 11.83213 -11.59385 0.23829
magnitude: 3.08204 au
magnitude: 7.83393 debye
