program: Orca
programVersion: 5.0.2
elementType: Cl S O O N N C C C C C C C C C C C C C C C C C C C H H H H H H H H H H H H H H H H H H H H H H H
charge: 0
multiplicity: 1
keywords: wb97x-d3
keywords: def2-TZVPP
keywords: def2/J RIJCOSX
keywords: DEFGRID2
keywords: scfconv7
keywords: smallprint printgap noloewdin
keywords: NOSOSCF
formula: C19H23ClN2O2S
InChI: InChI=1/C19H23ClN2O2S/c1-2-3-4-5-6-10-13-25-19(23)24-16-14-17(20)21-22-18(16)15-11-8-7-9-12-15/h7-9,11-12,14H,2-6,10,13H2,1H3
48 atoms
Cl -5.809435 -0.210444 1.071542
S  1.007601 -3.085398 0.288091
O  -1.224713 -1.979442 -0.049405
O  0.19911 -0.701305 1.136083
N  -2.826455 1.160515 -0.876519
N  -3.991516 1.015821 -0.291301
C  4.322204 0.125501 1.517438
C  3.459427 1.292864 1.054022
C  4.566856 -0.929118 0.439607
C  3.265186 2.352608 2.131374
C  3.306344 -1.588722 -0.115164
C  2.35735 3.501925 1.7023
C  2.573843 -2.42002 0.926693
C  2.970659 4.406446 0.64159
C  -0.032735 -1.71182 0.540141
C  -2.147987 -0.972789 -0.119517
C  -1.904256 0.213631 -0.829718
C  -0.638468 0.484501 -1.534947
C  -0.09051 -0.454411 -2.407342
C  0.014503 1.699303 -1.334438
C  -3.3591 -1.146913 0.488381
C  1.100303 -0.181029 -3.063816
C  1.207752 1.964626 -1.987944
C  1.755121 1.023945 -2.85085
C  -4.254244 -0.093656 0.35137
H  3.867818 -0.333461 2.401405
H  5.291628 0.508486 1.850579
H  2.473431 0.93166 0.74793
H  3.908766 1.736167 0.159383
H  5.235083 -1.701575 0.831771
H  5.099615 -0.464692 -0.395168
H  4.238104 2.751903 2.438485
H  2.840508 1.873709 3.01913
H  2.637705 -0.828906 -0.525445
H  3.576845 -2.236941 -0.951301
H  1.410887 3.091642 1.334241
H  2.104357 4.105502 2.577823
H  3.157525 -3.297635 1.208766
H  2.361245 -1.871521 1.8440
H  3.891679 4.866832 1.004957
H  2.288829 5.212039 0.365096
H  3.215987 3.86277 -0.271729
H  -0.599662 -1.390775 -2.596621
H  -0.401845 2.43131 -0.65438
H  -3.595819 -2.04185 1.04711
H  1.515256 -0.913918 -3.742634
H  1.712319 2.907068 -1.819413
H  2.688257 1.231504 -3.357694
elementType: Cl S O N C H
totalener: -1856.32186300 hartree
nucrepener: 2556.97677600 hartree
electener: -4413.29863900 hartree
oneelecener: -7626.36464116 hartree
twoeener: 3213.06600216 hartree
cpcmener: -0.02923736 hartree
kineticenergy: 1850.61780307 hartree
xcener: -138.240142160407 hartree
chargesum: 0.0000000
charge: -0.045907 -0.044041 -0.284398 -0.399746 -0.147350 -0.203445 -0.144016 -0.080601 -0.147137 -0.111977 -0.089953 -0.111405 -0.106274 -0.283452 0.365684 0.171312 0.256923 0.028106 -0.163088 -0.173834 -0.130091 -0.194634 -0.219232 -0.094909 0.153954 0.067409 0.075587 0.008826 0.070895 0.082166 0.077299 0.061785 0.069001 -0.003191 0.100628 0.050768 0.075783 0.136466 0.116153 0.087922 0.094510 0.071291 0.159019 0.145009 0.155011 0.157815 0.178820 0.160541
qa: -0.0459 -0.0440 -0.2844 -0.3997 -0.1473 -0.2034 -0.1440 -0.0806 -0.1471 -0.1120 -0.0900 -0.1114 -0.1063 -0.2835 0.3657 0.1713 0.2569 0.0281 -0.1631 -0.1738 -0.1301 -0.1946 -0.2192 -0.0949 0.1540 0.0674 0.0756 0.0088 0.0709 0.0822 0.0773 0.0618 0.0690 -0.0032 0.1006 0.0508 0.0758 0.1365 0.1162 0.0879 0.0945 0.0713 0.1590 0.1450 0.1550 0.1578 0.1788 0.1605
va: 1.2575 2.4200 2.1220 2.0900 2.9479 2.9375 3.9095 3.8472 3.9408 3.8843 3.8901 3.8898 3.8712 3.9207 4.2558 3.8813 3.8069 3.5571 3.8482 3.9156 4.0432 3.8868 3.8879 3.8070 4.2130 1.0048 1.0117 1.0095 1.0051 1.0078 1.0100 1.0104 1.0106 1.0278 1.0156 1.0107 1.0092 1.0082 1.0254 1.0032 1.0029 1.0012 1.0069 1.0171 1.0062 0.9935 0.9794 0.9897
dispcorr: -0.028864427 hartree
energy: -1856.350727426000
dipole: 63.22165 -60.91520 2.30645 19.90079 -22.00164 -2.10085 4.60365 -4.52979 0.07386
magnitude: 3.12070 au
magnitude: 7.93218 debye
