program: Orca
programVersion: 5.0.2
elementType: Cl S O O N N C C C C C C C C C C C C C C C C C C C H H H H H H H H H H H H H H H H H H H H H H H
charge: 0
multiplicity: 1
keywords: wb97x-d3
keywords: def2-TZVPP
keywords: def2/J RIJCOSX
keywords: DEFGRID2
keywords: scfconv7
keywords: smallprint printgap noloewdin
keywords: NOSOSCF
formula: C19H23ClN2O2S
InChI: InChI=1/C19H23ClN2O2S/c1-2-3-4-5-6-10-13-25-19(23)24-16-14-17(20)21-22-18(16)15-11-8-7-9-12-15/h7-9,11-12,14H,2-6,10,13H2,1H3
48 atoms
Cl -3.602991 1.626221 2.291653
S  1.973468 -2.31593 -0.195198
O  -0.34722 -1.345779 -0.143406
O  1.198722 0.140655 -0.831497
N  -2.654868 1.159347 -1.379018
N  -3.19724 1.577913 -0.259384
C  3.948531 0.079715 3.220809
C  2.872609 1.165409 3.15422
C  3.826293 -1.015641 2.162311
C  1.445352 0.635133 3.241506
C  3.903258 -0.485998 0.737034
C  0.380605 1.726668 3.309558
C  3.602204 -1.513018 -0.344529
C  0.311867 2.603793 2.067155
C  0.914991 -0.958316 -0.453797
C  -1.322346 -0.384943 -0.189702
C  -1.74578 0.197757 -1.392595
C  -1.199413 -0.185684 -2.706137
C  -0.80449 0.807615 -3.600747
C  -1.073248 -1.525971 -3.068841
C  -1.895457 0.014813 0.984225
C  -0.276834 0.464349 -4.835895
C  -0.548877 -1.864145 -4.308138
C  -0.144278 -0.872124 -5.19089
C  -2.848397 1.019261 0.872102
H  3.916777 -0.389942 4.208626
H  4.932537 0.552208 3.141404
H  2.996023 1.753328 2.240215
H  3.040145 1.867132 3.978218
H  2.886107 -1.553029 2.309551
H  4.617793 -1.755142 2.315402
H  1.357672 -0.004004 4.126746
H  1.229399 -0.010527 2.383012
H  3.243416 0.372106 0.612399
H  4.913362 -0.113555 0.539245
H  -0.594265 1.257883 3.469526
H  0.558062 2.354307 4.188328
H  3.689768 -1.0852 -1.342839
H  4.297764 -2.353133 -0.293497
H  1.207992 3.21438 1.946882
H  -0.539177 3.285532 2.112515
H  0.202891 2.004887 1.16044
H  -0.894242 1.850276 -3.324132
H  -1.400986 -2.310726 -2.399143
H  -1.601515 -0.403948 1.936907
H  0.036605 1.242113 -5.519711
H  -0.459789 -2.90656 -4.584224
H  0.271607 -1.139084 -6.154108
elementType: Cl S O N C H
totalener: -1856.32029111 hartree
nucrepener: 2589.63324253 hartree
electener: -4445.95353364 hartree
oneelecener: -7691.46149032 hartree
twoeener: 3245.50795668 hartree
cpcmener: -0.03024855 hartree
kineticenergy: 1850.59739968 hartree
xcener: -138.237354349818 hartree
chargesum: -0.0000000
charge: -0.045495 -0.044703 -0.292764 -0.405741 -0.147482 -0.193689 -0.160783 -0.127287 -0.142894 -0.107810 -0.152101 -0.116007 -0.131832 -0.288319 0.384099 0.180246 0.273781 0.030419 -0.198963 -0.186822 -0.160277 -0.167830 -0.168004 -0.130814 0.159513 0.073919 0.074980 0.069670 0.076828 0.064937 0.088721 0.078683 0.034257 0.082909 0.096344 0.056589 0.071851 0.133647 0.129950 0.101006 0.093196 0.066500 0.144005 0.155382 0.162552 0.161196 0.160980 0.163455
qa: -0.0455 -0.0447 -0.2928 -0.4057 -0.1475 -0.1937 -0.1608 -0.1273 -0.1429 -0.1078 -0.1521 -0.1160 -0.1318 -0.2883 0.3841 0.1802 0.2738 0.0304 -0.1990 -0.1868 -0.1603 -0.1678 -0.1680 -0.1308 0.1595 0.0739 0.0750 0.0697 0.0768 0.0649 0.0887 0.0787 0.0343 0.0829 0.0963 0.0566 0.0719 0.1336 0.1300 0.1010 0.0932 0.0665 0.1440 0.1554 0.1626 0.1612 0.1610 0.1635
va: 1.2587 2.4088 2.1019 2.0826 2.9508 2.9347 3.9358 3.8526 3.8570 3.8780 3.8394 3.8760 3.9175 3.9155 4.2048 3.8162 3.7791 3.5528 3.9847 3.8947 4.0058 3.9266 3.9094 3.8814 4.2045 1.0079 1.0084 1.0010 1.0102 1.0143 1.0129 1.0139 1.0139 1.0183 1.0096 1.0140 1.0122 1.0137 1.0055 1.0020 1.0086 1.0000 1.0182 1.0091 0.9947 0.9916 0.9916 0.9879
dispcorr: -0.029222095 hartree
energy: -1856.349513200158
dipole: 39.37997 -36.99770 2.38227 2.87493 -4.85300 -1.97807 14.10878 -13.53394 0.57483
magnitude: 3.14935 au
magnitude: 8.00501 debye
