program: Orca
programVersion: 5.0.2
elementType: Cl S O O N N C C C C C C C C C C C C C C C C C C C H H H H H H H H H H H H H H H H H H H H H H H
charge: 0
multiplicity: 1
keywords: wb97x-d3
keywords: def2-TZVPP
keywords: def2/J RIJCOSX
keywords: DEFGRID2
keywords: scfconv7
keywords: smallprint printgap noloewdin
keywords: NOSOSCF
formula: C19H23ClN2O2S
InChI: InChI=1/C19H23ClN2O2S/c1-2-3-4-5-6-10-13-25-19(23)24-16-14-17(20)21-22-18(16)15-11-8-7-9-12-15/h7-9,11-12,14H,2-6,10,13H2,1H3
48 atoms
Cl -6.314005 -1.45361 -0.1974
S  0.959201 -2.783794 0.210305
O  -1.300628 -1.894032 -0.406539
O  -0.496624 -0.959497 1.480023
N  -3.438188 1.021981 -0.610557
N  -4.624419 0.477571 -0.480341
C  4.905246 0.502216 1.56011
C  4.203532 1.805834 1.200693
C  3.961016 -0.584995 2.064903
C  5.154982 2.931695 0.805972
C  2.915334 -0.991947 1.031802
C  6.020397 2.645265 -0.419462
C  2.165665 -2.242446 1.45552
C  5.222246 2.370749 -1.686131
C  -0.369126 -1.713468 0.561432
C  -2.409568 -1.094282 -0.410129
C  -2.332821 0.29427 -0.597513
C  -1.064078 1.025305 -0.770708
C  -0.843265 2.189536 -0.036412
C  -0.095465 0.590373 -1.67412
C  -3.636448 -1.68199 -0.276612
C  0.3303 2.907631 -0.201426
C  1.076694 1.314664 -1.837872
C  1.29197 2.473063 -1.103996
C  -4.723283 -0.819734 -0.335363
H  5.661957 0.701194 2.32561
H  5.447328 0.117164 0.690536
H  3.606666 2.135742 2.057555
H  3.486976 1.631128 0.393809
H  3.46057 -0.248834 2.978347
H  4.550179 -1.463832 2.343628
H  5.806524 3.162338 1.654914
H  4.570244 3.838365 0.619559
H  2.207313 -0.176061 0.86849
H  3.404581 -1.17807 0.071122
H  6.674797 3.504585 -0.589143
H  6.686674 1.801786 -0.218916
H  2.846492 -3.089069 1.557159
H  1.657562 -2.123578 2.412898
H  4.548808 3.199625 -1.916489
H  4.614466 1.467774 -1.601733
H  5.880247 2.236768 -2.545913
H  -1.586953 2.530024 0.672433
H  -0.258916 -0.29595 -2.273786
H  -3.745735 -2.747453 -0.128044
H  0.494096 3.807904 0.376135
H  1.820505 0.975474 -2.546777
H  2.205389 3.038521 -1.237017
elementType: Cl S O N C H
totalener: -1856.32160100 hartree
nucrepener: 2489.94796841 hartree
electener: -4346.26956942 hartree
oneelecener: -7491.92965206 hartree
twoeener: 3145.66008265 hartree
cpcmener: -0.02964123 hartree
kineticenergy: 1850.61327652 hartree
xcener: -138.238241854493 hartree
chargesum: -0.0000000
charge: -0.045979 -0.044597 -0.284211 -0.398825 -0.146755 -0.202327 -0.146099 -0.049606 -0.151188 -0.161483 -0.097575 -0.104693 -0.104192 -0.286085 0.358173 0.182606 0.256059 -0.000536 -0.164205 -0.159630 -0.133505 -0.183154 -0.202561 -0.115033 0.154062 0.075786 0.069110 0.081315 -0.012478 0.073558 0.077102 0.072848 0.076107 0.049420 0.076407 0.070146 0.061938 0.131142 0.117344 0.083911 0.072678 0.099618 0.142562 0.161611 0.156291 0.158300 0.155597 0.181026
qa: -0.0460 -0.0446 -0.2842 -0.3988 -0.1468 -0.2023 -0.1461 -0.0496 -0.1512 -0.1615 -0.0976 -0.1047 -0.1042 -0.2861 0.3582 0.1826 0.2561 -0.0005 -0.1642 -0.1596 -0.1335 -0.1832 -0.2026 -0.1150 0.1541 0.0758 0.0691 0.0813 -0.0125 0.0736 0.0771 0.0728 0.0761 0.0494 0.0764 0.0701 0.0619 0.1311 0.1173 0.0839 0.0727 0.0996 0.1426 0.1616 0.1563 0.1583 0.1556 0.1810
va: 1.2573 2.4138 2.1216 2.0969 2.9458 2.9355 3.9133 3.8289 3.9366 3.9117 3.8563 3.8625 3.8816 3.9316 4.2676 3.8649 3.8161 3.5552 3.9676 3.8653 4.0434 3.9560 3.8888 3.8000 4.2122 1.0128 1.0037 1.0118 1.0319 1.0095 1.0105 1.0101 1.0072 1.0217 1.0141 1.0092 1.0031 1.0094 1.0237 0.9991 0.9952 1.0074 1.0166 1.0051 1.0057 0.9951 0.9975 0.9748
dispcorr: -0.027146889 hartree
energy: -1856.348747892142
dipole: 77.76534 -75.04586 2.71947 23.37107 -24.96845 -1.59738 5.88514 -5.81585 0.06929
magnitude: 3.15467 au
magnitude: 8.01855 debye
