program: Orca
programVersion: 5.0.2
elementType: Cl S O O N N C C C C C C C C C C C C C C C C C C C H H H H H H H H H H H H H H H H H H H H H H H
charge: 0
multiplicity: 1
keywords: wb97x-d3
keywords: def2-TZVPP
keywords: def2/J RIJCOSX
keywords: DEFGRID2
keywords: scfconv7
keywords: smallprint printgap noloewdin
keywords: NOSOSCF
formula: C19H23ClN2O2S
InChI: InChI=1/C19H23ClN2O2S/c1-2-3-4-5-6-10-13-25-19(23)24-16-14-17(20)21-22-18(16)15-11-8-7-9-12-15/h7-9,11-12,14H,2-6,10,13H2,1H3
48 atoms
Cl -5.791277 -0.012752 0.941591
S  1.001683 -2.970599 0.640206
O  -1.191104 -1.876801 0.082435
O  0.249673 -0.456446 1.069549
N  -2.794621 1.142932 -1.119774
N  -3.964323 1.061995 -0.531724
C  4.358857 0.349279 1.146244
C  3.549976 1.347262 0.325207
C  4.638868 -0.959367 0.409062
C  3.300922 2.68124 1.020544
C  3.391228 -1.727893 -0.021738
C  2.43995 2.577809 2.274307
C  2.590172 -2.253602 1.159563
C  2.121175 3.935734 2.880316
C  -0.00295 -1.545185 0.644074
C  -2.11325 -0.886123 -0.118794
C  -1.867841 0.210955 -0.961115
C  -0.602315 0.418934 -1.688287
C  0.00609 -0.614085 -2.399663
C  -0.014645 1.683563 -1.679139
C  -3.330041 -0.995304 0.493719
C  1.190556 -0.382697 -3.084256
C  1.168603 1.908787 -2.363447
C  1.776508 0.874992 -3.063797
C  -4.229949 0.029253 0.227954
H  3.851165 0.140668 2.09183
H  5.315567 0.805378 1.419233
H  2.582108 0.914993 0.0568
H  4.068417 1.527164 -0.622602
H  5.261962 -1.603929 1.036192
H  5.230054 -0.745219 -0.485947
H  2.809546 3.357535 0.31287
H  4.257244 3.152427 1.273154
H  2.75974 -1.092947 -0.646755
H  3.684807 -2.572129 -0.649107
H  1.507969 2.058876 2.027898
H  2.940841 1.95941 3.023601
H  3.119051 -3.064815 1.661856
H  2.387252 -1.494051 1.913262
H  3.032227 4.471122 3.15445
H  1.513543 3.839881 3.781127
H  1.570733 4.564348 2.17774
H  -0.450133 -1.594355 -2.447317
H  -0.475889 2.488473 -1.122236
H  -3.567755 -1.820408 1.151196
H  1.653458 -1.18921 -3.637057
H  1.622477 2.890775 -2.340851
H  2.704106 1.050004 -3.592705
elementType: Cl S O N C H
totalener: -1856.32084549 hartree
nucrepener: 2559.96361079 hartree
electener: -4416.28445629 hartree
oneelecener: -7632.42300591 hartree
twoeener: 3216.13854962 hartree
cpcmener: -0.02883450 hartree
kineticenergy: 1850.61064909 hartree
xcener: -138.239175525507 hartree
chargesum: -0.0000000
charge: -0.045609 -0.046243 -0.283957 -0.403486 -0.145395 -0.205902 -0.145428 -0.054185 -0.154344 -0.151621 -0.083692 -0.069762 -0.111706 -0.290374 0.373416 0.172907 0.257987 0.005495 -0.160399 -0.146327 -0.129637 -0.188726 -0.212548 -0.099833 0.154914 0.068310 0.076912 -0.015501 0.084771 0.080567 0.077496 0.069357 0.069102 0.007677 0.099559 0.048818 0.060549 0.135798 0.114506 0.079177 0.089799 0.078868 0.162032 0.141849 0.155060 0.158140 0.158936 0.162674
qa: -0.0456 -0.0462 -0.2840 -0.4035 -0.1454 -0.2059 -0.1454 -0.0542 -0.1543 -0.1516 -0.0837 -0.0698 -0.1117 -0.2904 0.3734 0.1729 0.2580 0.0055 -0.1604 -0.1463 -0.1296 -0.1887 -0.2125 -0.0998 0.1549 0.0683 0.0769 -0.0155 0.0848 0.0806 0.0775 0.0694 0.0691 0.0077 0.0996 0.0488 0.0605 0.1358 0.1145 0.0792 0.0898 0.0789 0.1620 0.1418 0.1551 0.1581 0.1589 0.1627
va: 1.2581 2.4161 2.1232 2.0819 2.9446 2.9367 3.8993 3.8567 3.9545 3.8872 3.8802 3.8464 3.8692 3.9574 4.2349 3.8829 3.8077 3.5715 3.8390 3.9014 4.0400 3.8809 3.9021 3.7962 4.2113 1.0015 1.0126 1.0220 1.0083 1.0077 1.0102 1.0095 1.0106 1.0277 1.0169 1.0157 1.0063 1.0081 1.0264 1.0004 1.0031 1.0008 1.0057 1.0188 1.0064 0.9940 0.9933 0.9882
dispcorr: -0.028652185 hartree
energy: -1856.349497679508
dipole: 61.76114 -59.45544 2.30570 17.22457 -19.33817 -2.11360 7.60988 -7.28383 0.32605
magnitude: 3.14482 au
magnitude: 7.99350 debye
