program: Orca
programVersion: 5.0.2
elementType: Cl S O O N N C C C C C C C C C C C C C C C C C C C H H H H H H H H H H H H H H H H H H H H H H H
charge: 0
multiplicity: 1
keywords: wb97x-d3
keywords: def2-TZVPP
keywords: def2/J RIJCOSX
keywords: DEFGRID2
keywords: scfconv7
keywords: smallprint printgap noloewdin
keywords: NOSOSCF
formula: C19H23ClN2O2S
InChI: InChI=1/C19H23ClN2O2S/c1-2-3-4-5-6-10-13-25-19(23)24-16-14-17(20)21-22-18(16)15-11-8-7-9-12-15/h7-9,11-12,14H,2-6,10,13H2,1H3
48 atoms
Cl -6.097983 -1.545866 -0.392014
S  1.072992 -2.118354 1.172253
O  -1.064321 -1.577573 -0.024472
O  -0.758487 -0.290571 1.796011
N  -3.352486 1.020297 -1.072928
N  -4.510631 0.417538 -0.932538
C  3.684236 1.827707 1.44782
C  4.925263 1.319394 0.71632
C  2.561417 0.805788 1.615823
C  4.651125 0.821465 -0.6979
C  3.001606 -0.460529 2.335046
C  5.904449 0.415478 -1.468155
C  1.87759 -1.431111 2.655552
C  6.622294 -0.79403 -0.885575
C  -0.374047 -1.154673 1.063959
C  -2.22558 -0.917202 -0.325593
C  -2.215732 0.401261 -0.801812
C  -0.973597 1.165784 -1.013373
C  0.065579 0.636871 -1.77692
C  -0.848778 2.443414 -0.471803
C  -3.41857 -1.566254 -0.182112
C  1.210407 1.385878 -2.004036
C  0.303127 3.182864 -0.691133
C  1.332552 2.657264 -1.460426
C  -4.544173 -0.824661 -0.521485
H  3.286112 2.696806 0.914879
H  3.982603 2.190795 2.436088
H  5.402275 0.531897 1.306477
H  5.655434 2.133704 0.667068
H  2.147209 0.547686 0.63676
H  1.745801 1.273742 2.174546
H  4.135551 1.611074 -1.25342
H  3.960544 -0.028701 -0.671106
H  3.767213 -0.982897 1.755961
H  3.469629 -0.198098 3.289325
H  5.62665 0.198147 -2.50303
H  6.59365 1.264549 -1.512229
H  2.262328 -2.299527 3.190201
H  1.109892 -0.981085 3.284561
H  7.001813 -0.603146 0.11903
H  7.47433 -1.082967 -1.502544
H  5.954462 -1.656214 -0.825859
H  -0.026024 -0.346067 -2.221095
H  -1.648856 2.855566 0.12947
H  -3.480414 -2.582347 0.182173
H  2.008033 0.974965 -2.608478
H  0.396696 4.171027 -0.260515
H  2.23042 3.236273 -1.632498
elementType: Cl S O N C H
totalener: -1856.32098397 hartree
nucrepener: 2524.11775878 hartree
electener: -4380.43874274 hartree
oneelecener: -7560.43749113 hartree
twoeener: 3179.99874838 hartree
cpcmener: -0.03013220 hartree
kineticenergy: 1850.61031006 hartree
xcener: -138.239169359842 hartree
chargesum: -0.0000000
charge: -0.045731 -0.044866 -0.288420 -0.401976 -0.149982 -0.199808 -0.172102 -0.127207 -0.078660 -0.119673 -0.135654 -0.108745 -0.118087 -0.278292 0.365880 0.171380 0.254417 0.037082 -0.177630 -0.194631 -0.124572 -0.158512 -0.152903 -0.157270 0.151379 0.077586 0.085618 0.070083 0.077138 0.000557 0.087646 0.066506 0.056971 0.077479 0.086392 0.068166 0.054742 0.134305 0.116445 0.080631 0.092901 0.078575 0.153512 0.144519 0.156853 0.161971 0.159083 0.166903
qa: -0.0457 -0.0449 -0.2884 -0.4020 -0.1500 -0.1998 -0.1721 -0.1272 -0.0787 -0.1197 -0.1357 -0.1087 -0.1181 -0.2783 0.3659 0.1714 0.2544 0.0371 -0.1776 -0.1946 -0.1246 -0.1585 -0.1529 -0.1573 0.1514 0.0776 0.0856 0.0701 0.0771 0.0006 0.0876 0.0665 0.0570 0.0775 0.0864 0.0682 0.0547 0.1343 0.1164 0.0806 0.0929 0.0786 0.1535 0.1445 0.1569 0.1620 0.1591 0.1669
va: 1.2575 2.4089 2.1173 2.0932 2.9523 2.9367 3.9292 3.8593 3.8158 3.8711 3.9091 3.9112 3.8918 3.9289 4.2615 3.8612 3.8040 3.5532 3.8858 3.9748 4.0533 3.8395 3.8990 3.8252 4.2127 1.0079 1.0072 0.9996 1.0107 1.0309 1.0154 1.0147 1.0031 1.0068 1.0114 1.0066 1.0088 1.0079 1.0291 0.9986 1.0051 1.0007 1.0088 1.0152 1.0049 0.9909 0.9931 0.9870
dispcorr: -0.028261303 hartree
energy: -1856.349245270188
dipole: 76.02092 -73.30679 2.71414 14.26153 -15.66423 -1.40269 5.31716 -4.51807 0.79908
magnitude: 3.15795 au
magnitude: 8.02686 debye
