program: Orca
programVersion: 5.0.2
elementType: Cl S O O N N C C C C C C C C C C C C C C C C C C C H H H H H H H H H H H H H H H H H H H H H H H
charge: 0
multiplicity: 1
keywords: wb97x-d3
keywords: def2-TZVPP
keywords: def2/J RIJCOSX
keywords: DEFGRID2
keywords: scfconv7
keywords: smallprint printgap noloewdin
keywords: NOSOSCF
formula: C19H23ClN2O2S
InChI: InChI=1/C19H23ClN2O2S/c1-2-3-4-5-6-10-13-25-19(23)24-16-14-17(20)21-22-18(16)15-11-8-7-9-12-15/h7-9,11-12,14H,2-6,10,13H2,1H3
48 atoms
Cl -6.043203 -1.985739 -1.073888
S  1.14665 -1.930794 0.921619
O  -1.090253 -1.57879 -0.181276
O  -1.028385 -0.797555 1.929321
N  -3.635367 0.946832 -0.652694
N  -4.707009 0.207788 -0.826012
C  3.765385 0.206328 0.728486
C  5.085233 0.812219 0.268406
C  3.480251 0.461304 2.202664
C  5.350323 0.594137 -1.215204
C  2.087396 0.06676 2.681996
C  6.668784 1.190298 -1.690582
C  1.754586 -1.415828 2.55742
C  6.913911 0.969185 -3.17537
C  -0.482513 -1.330727 1.007713
C  -2.307894 -0.992999 -0.396253
C  -2.446923 0.402039 -0.458848
C  -1.306246 1.32237 -0.29773
C  -0.156555 1.173874 -1.070958
C  -1.382185 2.357221 0.631708
C  -3.407985 -1.780438 -0.584685
C  0.90149 2.058018 -0.918798
C  -0.314574 3.226116 0.793381
C  0.829299 3.077978 0.019535
C  -4.596962 -1.096608 -0.812684
H  3.781076 -0.868958 0.524351
H  2.950774 0.616416 0.124184
H  5.907906 0.387266 0.853795
H  5.084383 1.886692 0.481996
H  3.61076 1.528304 2.40745
H  4.228108 -0.056404 2.812113
H  4.52742 1.026965 -1.795565
H  5.340328 -0.479521 -1.432995
H  2.006214 0.319944 3.742104
H  1.330678 0.670658 2.173611
H  6.68134 2.262655 -1.473107
H  7.49141 0.755129 -1.115025
H  2.637954 -2.034655 2.727212
H  1.012676 -1.726141 3.291919
H  7.862944 1.401152 -3.495537
H  6.126049 1.423963 -3.779011
H  6.939137 -0.094781 -3.41875
H  -0.09246 0.386693 -1.811483
H  -2.269842 2.472701 1.239954
H  -3.356379 -2.859943 -0.547115
H  1.784399 1.947054 -1.534687
H  -0.376639 4.021104 1.524677
H  1.660394 3.759638 0.143824
elementType: Cl S O N C H
totalener: -1856.32066154 hartree
nucrepener: 2482.17803206 hartree
electener: -4338.49869361 hartree
oneelecener: -7476.44295654 hartree
twoeener: 3137.94426294 hartree
cpcmener: -0.03001405 hartree
kineticenergy: 1850.61794618 hartree
xcener: -138.237060936522 hartree
chargesum: -0.0000000
charge: -0.045803 -0.040600 -0.286767 -0.402123 -0.146799 -0.202322 -0.112001 -0.121625 -0.118625 -0.100086 -0.117672 -0.081748 -0.137185 -0.282097 0.366986 0.173744 0.251052 0.030238 -0.176733 -0.183019 -0.131640 -0.180519 -0.159965 -0.133227 0.152487 0.066783 0.037899 0.061458 0.058128 0.070328 0.073728 0.054399 0.055825 0.096000 0.041394 0.053704 0.055143 0.134458 0.135376 0.090386 0.077425 0.077250 0.156271 0.144472 0.157521 0.167705 0.159049 0.161346
qa: -0.0458 -0.0406 -0.2868 -0.4021 -0.1468 -0.2023 -0.1120 -0.1216 -0.1186 -0.1001 -0.1177 -0.0817 -0.1372 -0.2821 0.3670 0.1737 0.2511 0.0302 -0.1767 -0.1830 -0.1316 -0.1805 -0.1600 -0.1332 0.1525 0.0668 0.0379 0.0615 0.0581 0.0703 0.0737 0.0544 0.0558 0.0960 0.0414 0.0537 0.0551 0.1345 0.1354 0.0904 0.0774 0.0772 0.1563 0.1445 0.1575 0.1677 0.1590 0.1613
va: 1.2575 2.4217 2.1169 2.0967 2.9511 2.9365 3.8779 3.9164 3.8967 3.8721 3.8975 3.8784 3.8746 3.9470 4.2700 3.8692 3.8151 3.5520 3.8795 3.9688 4.0452 3.8520 3.9082 3.8380 4.2124 1.0095 1.0205 1.0114 1.0114 1.0104 1.0103 1.0083 1.0088 1.0085 1.0276 1.0073 1.0073 1.0049 1.0185 1.0041 1.0009 1.0007 1.0090 1.0145 1.0047 0.9891 0.9917 0.9907
dispcorr: -0.026140821 hartree
energy: -1856.346802362858
dipole: 78.63219 -75.71994 2.91225 18.48472 -19.58767 -1.10295 2.78063 -2.18482 0.59581
magnitude: 3.17060 au
magnitude: 8.05902 debye
