program: Orca
programVersion: 5.0.2
elementType: Cl S O O N N C C C C C C C C C C C C C C C C C C C H H H H H H H H H H H H H H H H H H H H H H H
charge: 0
multiplicity: 1
keywords: wb97x-d3
keywords: def2-TZVPP
keywords: def2/J RIJCOSX
keywords: DEFGRID2
keywords: scfconv7
keywords: smallprint printgap noloewdin
keywords: NOSOSCF
formula: C19H23ClN2O2S
InChI: InChI=1/C19H23ClN2O2S/c1-2-3-4-5-6-10-13-25-19(23)24-16-14-17(20)21-22-18(16)15-11-8-7-9-12-15/h7-9,11-12,14H,2-6,10,13H2,1H3
48 atoms
Cl -5.986402 -0.766593 0.643665
S  1.006676 -3.074922 0.203344
O  -1.188942 -1.994225 -0.287526
O  -0.088044 -0.944028 1.37207
N  -2.982754 1.11006 -0.783468
N  -4.175451 0.790906 -0.340809
C  3.245951 0.280274 1.775703
C  3.242929 1.780543 1.49278
C  3.351175 -0.589823 0.527636
C  4.539307 2.281606 0.860308
C  3.535067 -2.071777 0.830892
C  4.70579 3.797541 0.886366
C  2.329207 -2.785229 1.420886
C  3.663859 4.548638 0.071512
C  -0.139987 -1.814037 0.553329
C  -2.184756 -1.056809 -0.289084
C  -1.984768 0.239398 -0.789029
C  -0.697416 0.7266 -1.316936
C  0.086876 -0.047136 -2.173045
C  -0.276347 2.013841 -0.984404
C  -3.420923 -1.411196 0.171851
C  1.27582 0.460065 -2.677302
C  0.909356 2.516402 -1.494295
C  1.692851 1.73893 -2.336681
C  -4.39286 -0.421136 0.104464
H  2.341905 0.024037 2.3339
H  4.085817 0.048764 2.44027
H  3.08025 2.312013 2.436369
H  2.388708 2.028325 0.855223
H  4.21031 -0.270469 -0.067049
H  2.476408 -0.434206 -0.113556
H  4.610259 1.935241 -0.17587
H  5.384433 1.828543 1.389433
H  3.848397 -2.600824 -0.072037
H  4.355016 -2.189191 1.546305
H  4.678511 4.145568 1.923726
H  5.7009 4.048728 0.509441
H  2.608462 -3.785447 1.752972
H  1.906206 -2.27268 2.284412
H  3.86223 5.621423 0.069644
H  2.656659 4.406739 0.465682
H  3.661822 4.213905 -0.968398
H  -0.235895 -1.032697 -2.480624
H  -0.874811 2.622099 -0.319334
H  -3.623769 -2.397252 0.566849
H  1.873484 -0.147426 -3.343811
H  1.223265 3.516803 -1.229031
H  2.621641 2.13154 -2.729756
elementType: Cl S O N C H
totalener: -1856.32021898 hartree
nucrepener: 2535.09543625 hartree
electener: -4391.41565523 hartree
oneelecener: -7582.68094866 hartree
twoeener: 3191.26529343 hartree
cpcmener: -0.02907786 hartree
kineticenergy: 1850.61193538 hartree
xcener: -138.239367113904 hartree
chargesum: -0.0000000
charge: -0.045185 -0.042757 -0.285712 -0.404864 -0.148651 -0.204029 -0.154250 -0.119516 -0.076542 -0.119698 -0.132363 -0.107336 -0.125212 -0.291945 0.359826 0.166696 0.256235 0.016393 -0.172984 -0.143129 -0.121915 -0.170131 -0.212826 -0.121875 0.152300 0.075823 0.069416 0.080170 0.046173 0.096027 -0.010035 0.062487 0.075609 0.087353 0.080148 0.053988 0.067186 0.138295 0.118335 0.098444 0.080766 0.078373 0.159696 0.139312 0.156906 0.156063 0.178404 0.160532
qa: -0.0452 -0.0428 -0.2857 -0.4049 -0.1487 -0.2040 -0.1542 -0.1195 -0.0765 -0.1197 -0.1324 -0.1073 -0.1252 -0.2919 0.3598 0.1667 0.2562 0.0164 -0.1730 -0.1431 -0.1219 -0.1701 -0.2128 -0.1219 0.1523 0.0758 0.0694 0.0802 0.0462 0.0960 -0.0100 0.0625 0.0756 0.0874 0.0801 0.0540 0.0672 0.1383 0.1183 0.0984 0.0808 0.0784 0.1597 0.1393 0.1569 0.1561 0.1784 0.1605
va: 1.2585 2.4163 2.1128 2.0829 2.9464 2.9365 3.8939 3.8710 3.8667 3.8600 3.9141 3.8968 3.8766 3.9364 4.2699 3.8771 3.8217 3.5588 3.8515 3.9472 4.0431 3.8811 3.8928 3.8199 4.2111 1.0182 1.0117 1.0122 1.0214 1.0099 1.0353 1.0066 1.0107 1.0124 1.0106 1.0091 1.0075 1.0065 1.0213 1.0082 0.9953 0.9972 1.0068 1.0227 1.0051 0.9951 0.9820 0.9911
dispcorr: -0.028421336 hartree
energy: -1856.348640312043
dipole: 67.08051 -64.62569 2.45481 23.36175 -25.41540 -2.05365 5.90262 -5.78433 0.11829
magnitude: 3.20275 au
magnitude: 8.14073 debye
