program: Orca
programVersion: 5.0.2
elementType: Cl S O O N N C C C C C C C C C C C C C C C C C C C H H H H H H H H H H H H H H H H H H H H H H H
charge: 0
multiplicity: 1
keywords: wb97x-d3
keywords: def2-TZVPP
keywords: def2/J RIJCOSX
keywords: DEFGRID2
keywords: scfconv7
keywords: smallprint printgap noloewdin
keywords: NOSOSCF
formula: C19H23ClN2O2S
InChI: InChI=1/C19H23ClN2O2S/c1-2-3-4-5-6-10-13-25-19(23)24-16-14-17(20)21-22-18(16)15-11-8-7-9-12-15/h7-9,11-12,14H,2-6,10,13H2,1H3
48 atoms
Cl -6.067581 -0.380694 0.655687
S  0.921718 -2.925699 0.509223
O  -1.333555 -1.972062 -0.056316
O  -0.129149 -0.609991 1.27248
N  -3.00869 1.05209 -1.123015
N  -4.208051 0.874769 -0.620506
C  5.079949 0.431085 0.599989
C  4.327595 1.578688 -0.071458
C  4.205141 -0.537572 1.389867
C  3.42822 2.395891 0.850382
C  3.084042 -1.164896 0.568545
C  4.159118 3.059754 2.010897
C  2.333545 -2.199298 1.39059
C  3.241339 3.930283 2.855019
C  -0.23199 -1.631166 0.658436
C  -2.297721 -1.017915 -0.231751
C  -2.051911 0.151693 -0.968866
C  -0.747782 0.464196 -1.581352
C  -0.056904 -0.480348 -2.339029
C  -0.207551 1.739654 -1.418242
C  -3.54097 -1.224726 0.294724
C  1.157305 -0.149988 -2.923428
C  1.005817 2.063996 -2.002756
C  1.690404 1.120407 -2.758255
C  -4.469207 -0.219984 0.047419
H  5.844569 0.832316 1.270829
H  5.623422 -0.124738 -0.170092
H  3.723492 1.183593 -0.892455
H  5.058826 2.246042 -0.53829
H  3.7712 -0.028637 2.256289
H  4.840036 -1.330712 1.796261
H  2.621699 1.767305 1.24369
H  2.932484 3.170191 0.255495
H  2.394364 -0.391773 0.222946
H  3.493925 -1.641009 -0.326081
H  4.618389 2.298808 2.648139
H  4.982913 3.665432 1.620236
H  2.974543 -3.051036 1.623967
H  1.980565 -1.796138 2.340222
H  2.792512 4.727295 2.259083
H  3.778534 4.399687 3.680169
H  2.42671 3.343603 3.284267
H  -0.472622 -1.465801 -2.504092
H  -0.732845 2.476017 -0.824315
H  -3.779918 -2.106863 0.872823
H  1.681968 -0.886477 -3.517115
H  1.418882 3.054702 -1.866176
H  2.635936 1.376338 -3.21786
elementType: Cl S O N C H
totalener: -1856.32207111 hartree
nucrepener: 2525.02180655 hartree
electener: -4381.34387767 hartree
oneelecener: -7562.35389749 hartree
twoeener: 3181.01001983 hartree
cpcmener: -0.02950284 hartree
kineticenergy: 1850.61587889 hartree
xcener: -138.240166475359 hartree
chargesum: 0.0000000
charge: -0.045552 -0.041041 -0.285656 -0.400894 -0.146530 -0.202426 -0.164816 -0.135455 -0.137216 -0.123908 -0.106220 -0.095192 -0.100901 -0.280443 0.358006 0.168482 0.261010 0.004968 -0.156636 -0.147091 -0.128111 -0.198082 -0.220752 -0.100485 0.152165 0.080610 0.077932 0.060805 0.079831 0.075750 0.085530 0.060194 0.074151 0.021845 0.086750 0.059278 0.060810 0.133936 0.117360 0.077877 0.089852 0.079162 0.160604 0.142680 0.155992 0.157678 0.167190 0.166961
qa: -0.0456 -0.0410 -0.2857 -0.4009 -0.1465 -0.2024 -0.1648 -0.1355 -0.1372 -0.1239 -0.1062 -0.0952 -0.1009 -0.2804 0.3580 0.1685 0.2610 0.0050 -0.1566 -0.1471 -0.1281 -0.1981 -0.2208 -0.1005 0.1522 0.0806 0.0779 0.0608 0.0798 0.0758 0.0855 0.0602 0.0742 0.0218 0.0867 0.0593 0.0608 0.1339 0.1174 0.0779 0.0899 0.0792 0.1606 0.1427 0.1560 0.1577 0.1672 0.1670
va: 1.2578 2.4208 2.1184 2.0902 2.9486 2.9365 3.9020 3.8561 3.8994 3.8470 3.8585 3.8742 3.8798 3.9438 4.2666 3.8796 3.8157 3.5561 3.8493 3.9347 4.0431 3.9012 3.9078 3.7922 4.2125 1.0027 1.0093 1.0233 1.0107 1.0024 1.0097 1.0024 1.0079 1.0245 1.0183 1.0055 1.0081 1.0088 1.0237 1.0014 1.0042 1.0007 1.0062 1.0178 1.0052 0.9945 0.9890 0.9857
dispcorr: -0.027631766 hartree
energy: -1856.349702879862
dipole: 68.85284 -66.41956 2.43328 20.93900 -22.90496 -1.96596 9.77908 -9.44184 0.33724
magnitude: 3.14636 au
magnitude: 7.99742 debye
