program: Orca
programVersion: 5.0.2
elementType: Cl S O O N N C C C C C C C C C C C C C C C C C C C H H H H H H H H H H H H H H H H H H H H H H H
charge: 0
multiplicity: 1
keywords: wb97x-d3
keywords: def2-TZVPP
keywords: def2/J RIJCOSX
keywords: DEFGRID2
keywords: scfconv7
keywords: smallprint printgap noloewdin
keywords: NOSOSCF
formula: C19H23ClN2O2S
InChI: InChI=1/C19H23ClN2O2S/c1-2-3-4-5-6-10-13-25-19(23)24-16-14-17(20)21-22-18(16)15-11-8-7-9-12-15/h7-9,11-12,14H,2-6,10,13H2,1H3
48 atoms
Cl -6.413542 -1.380695 -0.290788
S  0.901555 -2.869605 0.059165
O  -1.417419 -2.049839 -0.474941
O  -0.665085 -1.287926 1.505261
N  -3.411072 0.96861 -0.506412
N  -4.625788 0.476821 -0.425371
C  4.089323 0.962023 1.902395
C  4.820975 1.236871 0.594479
C  3.640944 -0.485542 2.08345
C  5.26981 2.686028 0.46431
C  2.604247 -0.919091 1.053841
C  5.998362 2.976413 -0.841117
C  2.084115 -2.319431 1.325792
C  6.452754 4.423216 -0.955239
C  -0.492473 -1.92852 0.510555
C  -2.495274 -1.209022 -0.442111
C  -2.34651 0.184499 -0.534475
C  -1.035475 0.852758 -0.646187
C  -0.096856 0.447289 -1.593891
C  -0.738597 1.921616 0.198034
C  -3.750577 -1.741467 -0.358882
C  1.117313 1.110954 -1.698558
C  0.479867 2.574595 0.096344
C  1.409627 2.172637 -0.854065
C  -4.791477 -0.820395 -0.370619
H  3.215449 1.619529 1.974077
H  4.742006 1.235878 2.736907
H  4.179371 0.987509 -0.256517
H  5.691986 0.576207 0.520987
H  3.219567 -0.603694 3.086132
H  4.509408 -1.150358 2.034756
H  5.920377 2.943463 1.30747
H  4.396982 3.343978 0.545087
H  1.776129 -0.205956 1.061744
H  3.031568 -0.89119 0.049604
H  6.864371 2.313115 -0.927781
H  5.343672 2.730818 -1.683084
H  2.8898 -3.054476 1.277924
H  1.621803 -2.412774 2.308729
H  5.605881 5.110307 -0.905473
H  6.970599 4.609125 -1.897145
H  7.137088 4.688442 -0.147064
H  -0.318136 -0.365355 -2.273696
H  -1.457302 2.235511 0.943722
H  -3.917993 -2.807156 -0.283773
H  1.836036 0.796255 -2.443454
H  0.703747 3.398745 0.760623
H  2.360016 2.685275 -0.933459
elementType: Cl S O N C H
totalener: -1856.32358093 hartree
nucrepener: 2477.59364887 hartree
electener: -4333.91722980 hartree
oneelecener: -7467.15309194 hartree
twoeener: 3133.23586214 hartree
cpcmener: -0.02947426 hartree
kineticenergy: 1850.60981060 hartree
xcener: -138.235823670029 hartree
chargesum: -0.0000000
charge: -0.045808 -0.041241 -0.283218 -0.394304 -0.146863 -0.203385 -0.116883 -0.129255 -0.145081 -0.143204 -0.112405 -0.073586 -0.113571 -0.284313 0.353868 0.174807 0.254948 0.014246 -0.159707 -0.160593 -0.132852 -0.193635 -0.183398 -0.128962 0.153626 0.061740 0.081002 0.053163 0.075795 0.079402 0.072287 0.072668 0.059269 0.048453 0.077237 0.059232 0.054801 0.132409 0.119355 0.078529 0.090118 0.077948 0.159231 0.142659 0.156857 0.155905 0.157657 0.175054
qa: -0.0458 -0.0412 -0.2832 -0.3943 -0.1469 -0.2034 -0.1169 -0.1293 -0.1451 -0.1432 -0.1124 -0.0736 -0.1136 -0.2843 0.3539 0.1748 0.2549 0.0142 -0.1597 -0.1606 -0.1329 -0.1936 -0.1834 -0.1290 0.1536 0.0617 0.0810 0.0532 0.0758 0.0794 0.0723 0.0727 0.0593 0.0485 0.0772 0.0592 0.0548 0.1324 0.1194 0.0785 0.0901 0.0779 0.1592 0.1427 0.1569 0.1559 0.1577 0.1751
va: 1.2575 2.4139 2.1215 2.1031 2.9475 2.9358 3.8697 3.8592 3.9341 3.8736 3.8613 3.8622 3.9097 3.9482 4.2772 3.8792 3.8136 3.5417 3.8460 3.9614 4.0421 3.8766 3.9138 3.8009 4.2130 1.0121 1.0130 1.0067 1.0139 1.0105 1.0090 1.0108 1.0057 1.0228 1.0120 1.0069 1.0066 1.0080 1.0240 1.0001 1.0042 1.0007 1.0063 1.0157 1.0053 0.9967 0.9956 0.9711
dispcorr: -0.026987705 hartree
energy: -1856.350568632646
dipole: 80.14028 -77.46241 2.67787 27.98498 -29.58257 -1.59760 6.77025 -6.84619 -0.07594
magnitude: 3.11915 au
magnitude: 7.92824 debye
