program: Orca
programVersion: 5.0.2
elementType: Cl S O O N N C C C C C C C C C C C C C C C C C C C H H H H H H H H H H H H H H H H H H H H H H H
charge: 0
multiplicity: 1
keywords: wb97x-d3
keywords: def2-TZVPP
keywords: def2/J RIJCOSX
keywords: DEFGRID2
keywords: scfconv7
keywords: smallprint printgap noloewdin
keywords: NOSOSCF
formula: C19H23ClN2O2S
InChI: InChI=1/C19H23ClN2O2S/c1-2-3-4-5-6-10-13-25-19(23)24-16-14-17(20)21-22-18(16)15-11-8-7-9-12-15/h7-9,11-12,14H,2-6,10,13H2,1H3
48 atoms
Cl -5.827553 -0.128596 0.95617
S  0.97571 -3.087002 0.409871
O  -1.23162 -1.960843 -0.008822
O  0.195788 -0.653767 1.139503
N  -2.803237 1.152319 -0.988756
N  -3.980489 1.035429 -0.421399
C  4.420981 0.111198 1.337665
C  3.539193 1.243006 0.825273
C  4.596325 -1.032682 0.34053
C  3.464234 2.426881 1.779328
C  3.297215 -1.682028 -0.129885
C  2.507884 3.512317 1.303178
C  2.56176 -2.408772 0.984764
C  2.428602 4.693905 2.256703
C  -0.045026 -1.685063 0.585141
C  -2.145707 -0.949899 -0.132074
C  -1.883874 0.206298 -0.885129
C  -0.605666 0.453123 -1.57761
C  -0.023656 -0.519519 -2.388902
C  0.022285 1.688888 -1.429986
C  -3.367969 -1.093922 0.462296
C  1.1740 -0.2571 -3.038026
C  1.22102 1.943768 -2.076858
C  1.801557 0.970352 -2.879332
C  -4.257381 -0.044527 0.265158
H  4.013997 -0.267176 2.280771
H  5.410918 0.508877 1.581149
H  2.52486 0.873499 0.650429
H  3.908372 1.581862 -0.149535
H  5.247047 -1.797773 0.774286
H  5.120434 -0.65462 -0.541839
H  4.463461 2.854334 1.915873
H  3.146454 2.076045 2.767448
H  2.644438 -0.928632 -0.575477
H  3.52077 -2.397342 -0.924349
H  2.818067 3.861258 0.31304
H  1.510771 3.079509 1.172183
H  3.129878 -3.274073 1.329735
H  2.372557 -1.784326 1.856489
H  1.728825 5.450997 1.900521
H  3.401414 5.175004 2.373964
H  2.096678 4.380845 3.248397
H  -0.510823 -1.474076 -2.540095
H  -0.418688 2.446948 -0.796136
H  -3.618188 -1.96455 1.05301
H  1.615733 -1.015756 -3.670018
H  1.706788 2.901845 -1.946776
H  2.739597 1.169535 -3.380539
elementType: Cl S O N C H
totalener: -1856.32252427 hartree
nucrepener: 2545.87667712 hartree
electener: -4402.19920139 hartree
oneelecener: -7604.18176869 hartree
twoeener: 3201.98256730 hartree
cpcmener: -0.02901428 hartree
kineticenergy: 1850.61687710 hartree
xcener: -138.238975320287 hartree
chargesum: -0.0000000
charge: -0.045705 -0.045707 -0.283124 -0.398190 -0.147160 -0.204074 -0.138875 -0.057998 -0.153803 -0.125280 -0.086683 -0.067946 -0.108294 -0.290542 0.364827 0.171797 0.259377 0.021504 -0.161158 -0.165925 -0.130297 -0.194743 -0.212657 -0.093950 0.154342 0.067739 0.074158 0.012722 0.064250 0.081893 0.078804 0.060654 0.056540 -0.002638 0.100136 0.053684 0.051402 0.135649 0.115810 0.090101 0.079425 0.078289 0.159700 0.144270 0.155037 0.157659 0.163259 0.161718
qa: -0.0457 -0.0457 -0.2831 -0.3982 -0.1472 -0.2041 -0.1389 -0.0580 -0.1538 -0.1253 -0.0867 -0.0679 -0.1083 -0.2905 0.3648 0.1718 0.2594 0.0215 -0.1612 -0.1659 -0.1303 -0.1947 -0.2127 -0.0940 0.1543 0.0677 0.0742 0.0127 0.0642 0.0819 0.0788 0.0607 0.0565 -0.0026 0.1001 0.0537 0.0514 0.1356 0.1158 0.0901 0.0794 0.0783 0.1597 0.1443 0.1550 0.1577 0.1633 0.1617
va: 1.2578 2.4160 2.1226 2.0921 2.9471 2.9370 3.9040 3.8445 3.9444 3.8952 3.8871 3.8655 3.8717 3.9698 4.2573 3.8823 3.8053 3.5640 3.8432 3.9045 4.0417 3.8781 3.8958 3.7913 4.2123 1.0040 1.0124 1.0093 1.0091 1.0083 1.0091 1.0098 1.0080 1.0287 1.0156 1.0056 1.0075 1.0085 1.0255 1.0035 1.0003 1.0002 1.0068 1.0175 1.0062 0.9941 0.9906 0.9886
dispcorr: -0.028309585 hartree
energy: -1856.350833851925
dipole: 62.86389 -60.56237 2.30152 19.89841 -22.00073 -2.10231 6.79843 -6.67132 0.12711
magnitude: 3.11976 au
magnitude: 7.92979 debye
