program: Orca
programVersion: 5.0.2
elementType: Cl S O O N N C C C C C C C C C C C C C C C C C C C H H H H H H H H H H H H H H H H H H H H H H H
charge: 0
multiplicity: 1
keywords: wb97x-d3
keywords: def2-TZVPP
keywords: def2/J RIJCOSX
keywords: DEFGRID2
keywords: scfconv7
keywords: smallprint printgap noloewdin
keywords: NOSOSCF
formula: C19H23ClN2O2S
InChI: InChI=1/C19H23ClN2O2S/c1-2-3-4-5-6-10-13-25-19(23)24-16-14-17(20)21-22-18(16)15-11-8-7-9-12-15/h7-9,11-12,14H,2-6,10,13H2,1H3
48 atoms
Cl -5.897014 -0.280971 0.931177
S  0.961955 -3.077249 0.386137
O  -1.243499 -1.953018 -0.031918
O  0.159764 -0.669166 1.174521
N  -2.873683 1.165377 -0.895371
N  -4.057181 0.992388 -0.356744
C  4.382354 0.085757 1.512944
C  3.573649 1.270593 0.999144
C  4.580509 -1.022512 0.480813
C  3.461645 2.396801 2.019634
C  3.292478 -1.647819 -0.047938
C  2.640114 3.587995 1.535502
C  2.531321 -2.415933 1.020734
C  3.305186 4.379888 0.418367
C  -0.068372 -1.68637 0.588782
C  -2.17664 -0.957358 -0.126049
C  -1.931581 0.239226 -0.818495
C  -0.646278 0.555908 -1.467149
C  -0.014675 -0.358446 -2.308262
C  -0.060677 1.801164 -1.243546
C  -3.405724 -1.15979 0.436674
C  1.193435 -0.031155 -2.907066
C  1.146502 2.12223 -1.842989
C  1.77949 1.204947 -2.672054
C  -4.318318 -0.125631 0.272503
H  3.909561 -0.315048 2.415437
H  5.368473 0.439241 1.829633
H  2.563252 0.948216 0.728904
H  4.0304 1.639338 0.07452
H  5.213474 -1.807234 0.9060
H  5.13411 -0.617165 -0.371003
H  4.463286 2.738401 2.30358
H  3.008553 1.997103 2.932293
H  2.651026 -0.876473 -0.479545
H  3.533732 -2.332275 -0.864107
H  1.657504 3.235907 1.203896
H  2.451466 4.258049 2.378354
H  3.093862 -3.291502 1.349156
H  2.318135 -1.823134 1.909653
H  4.261808 4.791853 0.746618
H  2.681176 5.215953 0.099192
H  3.499582 3.767171 -0.462902
H  -0.46929 -1.318004 -2.519281
H  -0.541922 2.515176 -0.587755
H  -3.644044 -2.063532 0.980653
H  1.675481 -0.745931 -3.560606
H  1.594974 3.089369 -1.657949
H  2.724717 1.45502 -3.135734
elementType: Cl S O N C H
totalener: -1856.32158756 hartree
nucrepener: 2550.02861605 hartree
electener: -4406.35020361 hartree
oneelecener: -7612.41958626 hartree
twoeener: 3206.06938265 hartree
cpcmener: -0.02922667 hartree
kineticenergy: 1850.61194330 hartree
xcener: -138.239092873140 hartree
chargesum: -0.0000000
charge: -0.045697 -0.045583 -0.282408 -0.399084 -0.146767 -0.204495 -0.143546 -0.081046 -0.148496 -0.116812 -0.091875 -0.108082 -0.106747 -0.291111 0.364417 0.175022 0.254987 0.013358 -0.157810 -0.155286 -0.131439 -0.194393 -0.236723 -0.092382 0.154088 0.067896 0.074747 0.017024 0.068747 0.081907 0.078602 0.061419 0.068988 0.000630 0.099654 0.049891 0.076507 0.135485 0.115712 0.089596 0.096228 0.072723 0.161687 0.143778 0.155227 0.157562 0.183269 0.160631
qa: -0.0457 -0.0456 -0.2824 -0.3991 -0.1468 -0.2045 -0.1435 -0.0810 -0.1485 -0.1168 -0.0919 -0.1081 -0.1067 -0.2911 0.3644 0.1750 0.2550 0.0134 -0.1578 -0.1553 -0.1314 -0.1944 -0.2367 -0.0924 0.1541 0.0679 0.0747 0.0170 0.0687 0.0819 0.0786 0.0614 0.0690 0.0006 0.0997 0.0499 0.0765 0.1355 0.1157 0.0896 0.0962 0.0727 0.1617 0.1438 0.1552 0.1576 0.1833 0.1606
va: 1.2576 2.4182 2.1238 2.0919 2.9463 2.9370 3.9062 3.8436 3.9394 3.8917 3.8929 3.8806 3.8703 3.9214 4.2583 3.8802 3.8117 3.5720 3.8346 3.9264 4.0405 3.8804 3.9059 3.7922 4.2123 1.0049 1.0119 1.0073 1.0063 1.0082 1.0096 1.0100 1.0104 1.0296 1.0160 1.0122 1.0099 1.0086 1.0256 1.0041 1.0018 0.9992 1.0057 1.0186 1.0063 0.9941 0.9755 0.9904
dispcorr: -0.028782825 hartree
energy: -1856.350370386022
dipole: 65.20818 -62.87998 2.32819 20.06445 -22.12692 -2.06247 4.44585 -4.31002 0.13583
magnitude: 3.11332 au
magnitude: 7.91342 debye
