program: Orca
programVersion: 5.0.2
elementType: Cl S O O N N C C C C C C C C C C C C C C C C C C C H H H H H H H H H H H H H H H H H H H H H H H
charge: 0
multiplicity: 1
keywords: wb97x-d3
keywords: def2-TZVPP
keywords: def2/J RIJCOSX
keywords: DEFGRID2
keywords: scfconv7
keywords: smallprint printgap noloewdin
keywords: NOSOSCF
formula: C19H23ClN2O2S
InChI: InChI=1/C19H23ClN2O2S/c1-2-3-4-5-6-10-13-25-19(23)24-16-14-17(20)21-22-18(16)15-11-8-7-9-12-15/h7-9,11-12,14H,2-6,10,13H2,1H3
48 atoms
Cl -6.092631 -1.090096 0.28977
S  1.090532 -2.634901 0.764981
O  -1.12164 -1.851335 -0.102127
O  -0.275098 -0.453811 1.446539
N  -3.177932 0.962872 -1.075977
N  -4.366838 0.556402 -0.697954
C  3.538375 0.081234 0.004164
C  4.232964 0.992298 1.00676
C  3.962565 -1.381182 0.071026
C  3.840105 2.453509 0.832133
C  3.709676 -2.070202 1.408391
C  4.547908 3.393409 1.798513
C  2.291849 -1.932591 1.943384
C  4.155297 4.849018 1.596566
C  -0.181919 -1.447766 0.78743
C  -2.210159 -1.043962 -0.291758
C  -2.102133 0.210112 -0.910471
C  -0.829078 0.766593 -1.403508
C  -0.489492 2.081006 -1.088737
C  0.014844 0.016113 -2.221634
C  -3.439913 -1.488997 0.102941
C  0.678413 2.638202 -1.586177
C  1.174322 0.58359 -2.728715
C  1.508907 1.89276 -2.412008
C  -4.498632 -0.624388 -0.148533
H  3.743293 0.448168 -1.005679
H  2.452801 0.166668 0.127835
H  5.318378 0.890502 0.897045
H  4.000593 0.678374 2.029882
H  5.030067 -1.45782 -0.153496
H  3.451672 -1.931366 -0.723827
H  2.755847 2.554151 0.956155
H  4.054947 2.765255 -0.196355
H  3.974695 -3.1272 1.327617
H  4.367173 -1.658646 2.17839
H  4.325674 3.092568 2.826823
H  5.630386 3.286686 1.679064
H  2.181465 -2.465606 2.886431
H  2.029629 -0.890261 2.118665
H  4.673577 5.5074 2.29491
H  3.083199 4.993949 1.742264
H  4.396577 5.186861 0.586783
H  -1.135846 2.665402 -0.447013
H  -0.243672 -0.998759 -2.494526
H  -3.574706 -2.44792 0.584238
H  0.938574 3.656722 -1.329932
H  1.817691 -0.000632 -3.373027
H  2.418024 2.329921 -2.803364
elementType: Cl S O N C H
totalener: -1856.32104760 hartree
nucrepener: 2515.64718552 hartree
electener: -4371.96823312 hartree
oneelecener: -7543.60271938 hartree
twoeener: 3171.63448627 hartree
cpcmener: -0.02965131 hartree
kineticenergy: 1850.62007467 hartree
xcener: -138.240186489259 hartree
chargesum: 0.0000000
charge: -0.045134 -0.043225 -0.286941 -0.403970 -0.148399 -0.200785 -0.058508 -0.140121 -0.174081 -0.100715 -0.154596 -0.083401 -0.119963 -0.281522 0.373245 0.170074 0.266567 0.016308 -0.158618 -0.180213 -0.126912 -0.190916 -0.175107 -0.130646 0.152646 0.081717 0.010468 0.064755 0.063256 0.079471 0.085151 0.054085 0.060014 0.099034 0.090006 0.054880 0.053782 0.133004 0.111096 0.090739 0.077452 0.077334 0.142736 0.156004 0.156702 0.160070 0.157940 0.165238
qa: -0.0451 -0.0432 -0.2869 -0.4040 -0.1484 -0.2008 -0.0585 -0.1401 -0.1741 -0.1007 -0.1546 -0.0834 -0.1200 -0.2815 0.3732 0.1701 0.2666 0.0163 -0.1586 -0.1802 -0.1269 -0.1909 -0.1751 -0.1306 0.1526 0.0817 0.0105 0.0648 0.0633 0.0795 0.0852 0.0541 0.0600 0.0990 0.0900 0.0549 0.0538 0.1330 0.1111 0.0907 0.0775 0.0773 0.1427 0.1560 0.1567 0.1601 0.1579 0.1652
va: 1.2582 2.4289 2.1155 2.0930 2.9486 2.9353 3.8383 3.8918 3.9138 3.8744 3.8793 3.8955 3.9066 3.9443 4.2593 3.8728 3.7891 3.5597 3.9514 3.8666 4.0481 3.8916 3.8561 3.8000 4.2108 1.0049 1.0099 1.0119 1.0059 1.0126 1.0110 1.0086 1.0058 1.0100 1.0031 1.0066 1.0077 1.0075 1.0212 1.0044 1.0008 1.0008 1.0169 1.0078 1.0052 0.9926 0.9943 0.9880
dispcorr: -0.027065887 hartree
energy: -1856.348113484170
dipole: 69.91486 -67.23535 2.67951 23.08362 -24.88241 -1.79880 8.58326 -8.08571 0.49755
magnitude: 3.26543 au
magnitude: 8.30006 debye
