program: Orca
programVersion: 5.0.2
elementType: Cl S O O N N C C C C C C C C C C C C C C C C C C C H H H H H H H H H H H H H H H H H H H H H H H
charge: 0
multiplicity: 1
keywords: wb97x-d3
keywords: def2-TZVPP
keywords: def2/J RIJCOSX
keywords: DEFGRID2
keywords: scfconv7
keywords: smallprint printgap noloewdin
keywords: NOSOSCF
formula: C19H23ClN2O2S
InChI: InChI=1/C19H23ClN2O2S/c1-2-3-4-5-6-10-13-25-19(23)24-16-14-17(20)21-22-18(16)15-11-8-7-9-12-15/h7-9,11-12,14H,2-6,10,13H2,1H3
48 atoms
Cl -6.360136 -1.376048 -0.061363
S  0.845867 -0.753937 1.830828
O  -1.507033 -0.462126 0.976528
O  -0.397005 -2.112723 -0.078572
N  -3.352373 -0.246337 -2.127128
N  -4.549547 -0.627821 -1.743587
C  4.904401 -0.117805 0.960993
C  5.653501 1.187796 1.208746
C  3.61582 0.042774 0.160723
C  4.946732 2.136182 2.170288
C  2.8587 -1.265688 -0.036876
C  5.77067 3.374525 2.49912
C  2.201256 -1.805864 1.224625
C  5.07633 4.30099 3.485402
C  -0.420119 -1.241311 0.740138
C  -2.533014 -0.520469 0.073858
C  -2.349457 -0.159211 -1.271121
C  -1.053286 0.307904 -1.79673
C  -0.519086 -0.281575 -2.940365
C  -0.351546 1.328568 -1.157199
C  -3.7732 -0.90595 0.496154
C  0.709424 0.135042 -3.428969
C  0.873539 1.747791 -1.654987
C  1.409405 1.148047 -2.785957
C  -4.758482 -0.920232 -0.485009
H  4.696039 -0.589169 1.927159
H  5.558762 -0.811385 0.42397
H  5.831807 1.696513 0.254967
H  6.642561 0.953305 1.614582
H  3.861488 0.455861 -0.821861
H  2.956579 0.777301 0.633844
H  4.718715 1.599658 3.098286
H  3.982439 2.446685 1.755974
H  2.105999 -1.149878 -0.819956
H  3.549505 -2.035788 -0.394425
H  6.73781 3.066179 2.907921
H  5.992119 3.920107 1.576741
H  1.815277 -2.81501 1.086544
H  2.902836 -1.85105 2.058549
H  4.868787 3.790405 4.427837
H  4.123734 4.65917 3.090293
H  5.686122 5.17601 3.714429
H  -1.054952 -1.080045 -3.436874
H  -0.764899 1.813775 -0.282418
H  -3.969606 -1.192463 1.520208
H  1.122945 -0.335569 -4.311033
H  1.409619 2.543987 -1.155967
H  2.369597 1.469817 -3.167256
elementType: Cl S O N C H
totalener: -1856.32197323 hartree
nucrepener: 2467.54837844 hartree
electener: -4323.87035167 hartree
oneelecener: -7447.09392867 hartree
twoeener: 3123.22357700 hartree
cpcmener: -0.02970102 hartree
kineticenergy: 1850.60769454 hartree
xcener: -138.236573497219 hartree
chargesum: -0.0000000
charge: -0.045906 -0.043380 -0.284445 -0.396244 -0.146157 -0.202876 -0.122059 -0.130550 -0.136542 -0.106003 -0.135469 -0.086189 -0.126081 -0.277518 0.363288 0.172349 0.248843 0.030128 -0.182688 -0.175949 -0.130786 -0.159879 -0.174161 -0.140866 0.151621 0.066228 0.076445 0.060463 0.071138 0.082980 0.050974 0.054957 0.057689 0.069569 0.088165 0.054500 0.055461 0.131512 0.132714 0.077040 0.076697 0.090124 0.144449 0.158271 0.157564 0.158408 0.160084 0.162087
qa: -0.0459 -0.0434 -0.2844 -0.3962 -0.1462 -0.2029 -0.1221 -0.1305 -0.1365 -0.1060 -0.1355 -0.0862 -0.1261 -0.2775 0.3633 0.1723 0.2488 0.0301 -0.1827 -0.1759 -0.1308 -0.1599 -0.1742 -0.1409 0.1516 0.0662 0.0764 0.0605 0.0711 0.0830 0.0510 0.0550 0.0577 0.0696 0.0882 0.0545 0.0555 0.1315 0.1327 0.0770 0.0767 0.0901 0.1444 0.1583 0.1576 0.1584 0.1601 0.1621
va: 1.2573 2.4118 2.1205 2.1031 2.9486 2.9372 3.9137 3.9080 3.8630 3.8577 3.8770 3.8810 3.8775 3.9444 4.2701 3.8731 3.8212 3.5456 3.9699 3.8642 4.0424 3.9100 3.8505 3.8340 4.2132 1.0092 1.0114 1.0102 1.0100 1.0092 1.0178 1.0086 1.0064 1.0247 1.0134 1.0081 1.0064 1.0215 1.0057 1.0010 1.0013 1.0043 1.0153 1.0072 1.0049 0.9924 0.9935 0.9908
dispcorr: -0.025886418 hartree
energy: -1856.347859648433
dipole: 78.74489 -76.15736 2.58753 23.03441 -22.83305 0.20136 14.64400 -12.81142 1.83258
magnitude: 3.17714 au
magnitude: 8.07565 debye
