program: Orca
programVersion: 5.0.2
elementType: Cl S O O N N C C C C C C C C C C C C C C C C C C C H H H H H H H H H H H H H H H H H H H H H H H
charge: 0
multiplicity: 1
keywords: wb97x-d3
keywords: def2-TZVPP
keywords: def2/J RIJCOSX
keywords: DEFGRID2
keywords: scfconv7
keywords: smallprint printgap noloewdin
keywords: NOSOSCF
formula: C19H23ClN2O2S
InChI: InChI=1/C19H23ClN2O2S/c1-2-3-4-5-6-10-13-25-19(23)24-16-14-17(20)21-22-18(16)15-11-8-7-9-12-15/h7-9,11-12,14H,2-6,10,13H2,1H3
48 atoms
Cl -6.181173 -0.430035 0.736347
S  0.849364 -2.896632 0.604126
O  -1.460228 -2.06397 0.026237
O  -0.206429 -0.506766 1.060249
N  -3.20162 0.814541 -1.300436
N  -4.378025 0.691558 -0.730039
C  3.748753 0.914758 1.163318
C  4.963991 1.775185 1.482969
C  4.10086 -0.308174 0.325566
C  4.624835 3.03591 2.265915
C  2.893131 -1.151419 -0.072952
C  5.845944 3.889502 2.583647
C  2.327812 -1.955768 1.088298
C  5.50255 5.15385 3.35587
C  -0.324539 -1.609774 0.612821
C  -2.445341 -1.147447 -0.221889
C  -2.238733 -0.067712 -1.094686
C  -0.966287 0.154738 -1.807343
C  -0.378081 -0.865311 -2.552837
C  -0.351485 1.403324 -1.746298
C  -3.665927 -1.30242 0.370551
C  0.806644 -0.633135 -3.235851
C  0.838039 1.627175 -2.421589
C  1.418481 0.610216 -3.168678
C  -4.608315 -0.331287 0.053345
H  3.009619 1.514999 0.621522
H  3.266677 0.610369 2.097472
H  5.462749 2.054482 0.548479
H  5.691162 1.180924 2.046802
H  4.826516 -0.930437 0.859529
H  4.602887 0.023732 -0.587282
H  4.120699 2.762196 3.199092
H  3.903819 3.632995 1.697052
H  2.121772 -0.497519 -0.489166
H  3.172907 -1.84455 -0.869368
H  6.564011 3.29439 3.155789
H  6.351599 4.157442 1.650901
H  3.040585 -2.713191 1.41945
H  2.082814 -1.34626 1.957875
H  4.820567 5.791274 2.790038
H  6.393388 5.742885 3.578142
H  5.018439 4.919494 4.305792
H  -0.854268 -1.834476 -2.626007
H  -0.795917 2.196004 -1.15863
H  -3.875802 -2.116859 1.050142
H  1.249874 -1.426898 -3.822125
H  1.313621 2.597062 -2.363368
H  2.346482 0.78692 -3.695947
elementType: Cl S O N C H
totalener: -1856.32303049 hartree
nucrepener: 2445.25108307 hartree
electener: -4301.57411357 hartree
oneelecener: -7402.79838988 hartree
twoeener: 3101.22427632 hartree
cpcmener: -0.02975593 hartree
kineticenergy: 1850.61976339 hartree
xcener: -138.235747734636 hartree
chargesum: 0.0000000
charge: -0.045796 -0.045025 -0.284578 -0.396693 -0.146522 -0.202416 -0.102683 -0.118809 -0.130596 -0.104246 -0.095181 -0.081003 -0.111913 -0.283174 0.362151 0.177509 0.254431 0.019022 -0.162819 -0.172539 -0.132814 -0.190474 -0.181154 -0.116170 0.154224 0.053873 0.062431 0.058419 0.059161 0.071321 0.077575 0.056649 0.055751 0.001881 0.100644 0.054162 0.054290 0.132116 0.116146 0.077839 0.090101 0.077839 0.156883 0.144949 0.156289 0.158243 0.158960 0.161749
qa: -0.0458 -0.0450 -0.2846 -0.3967 -0.1465 -0.2024 -0.1027 -0.1188 -0.1306 -0.1042 -0.0952 -0.0810 -0.1119 -0.2832 0.3622 0.1775 0.2544 0.0190 -0.1628 -0.1725 -0.1328 -0.1905 -0.1812 -0.1162 0.1542 0.0539 0.0624 0.0584 0.0592 0.0713 0.0776 0.0566 0.0558 0.0019 0.1006 0.0542 0.0543 0.1321 0.1161 0.0778 0.0901 0.0778 0.1569 0.1449 0.1563 0.1582 0.1590 0.1617
va: 1.2576 2.4135 2.1227 2.0981 2.9504 2.9369 3.8737 3.8919 3.9283 3.8750 3.9077 3.8752 3.8940 3.9479 4.2604 3.8691 3.8069 3.5492 3.8602 3.9483 4.0458 3.8834 3.8990 3.8132 4.2129 1.0104 1.0123 1.0104 1.0102 1.0091 1.0104 1.0091 1.0090 1.0370 1.0132 1.0072 1.0069 1.0101 1.0244 1.0006 1.0041 1.0006 1.0072 1.0149 1.0055 0.9939 0.9927 0.9887
dispcorr: -0.024921147 hartree
energy: -1856.347951641701
dipole: 76.67169 -74.22762 2.44407 26.83070 -28.72698 -1.89627 12.68674 -12.34009 0.34664
magnitude: 3.11279 au
magnitude: 7.91209 debye
