program: Orca
programVersion: 5.0.2
elementType: Cl S O O N N C C C C C C C C C C C C C C C C C C C H H H H H H H H H H H H H H H H H H H H H H H
charge: 0
multiplicity: 1
keywords: wb97x-d3
keywords: def2-TZVPP
keywords: def2/J RIJCOSX
keywords: DEFGRID2
keywords: scfconv7
keywords: smallprint printgap noloewdin
keywords: NOSOSCF
formula: C19H23ClN2O2S
InChI: InChI=1/C19H23ClN2O2S/c1-2-3-4-5-6-10-13-25-19(23)24-16-14-17(20)21-22-18(16)15-11-8-7-9-12-15/h7-9,11-12,14H,2-6,10,13H2,1H3
48 atoms
Cl -6.293677 -1.728072 -0.943231
S  0.615391 -1.919459 1.810438
O  -1.641916 -1.253239 0.939659
O  -0.264177 -1.963701 -0.695425
N  -3.329577 0.556378 -1.7008
N  -4.498202 -0.041091 -1.716477
C  4.218746 0.900824 0.69086
C  4.593847 1.99938 1.676777
C  3.323483 -0.160739 1.312843
C  5.417576 3.131791 1.069748
C  2.876047 -1.217546 0.313302
C  6.741235 2.70622 0.438632
C  2.145452 -2.388787 0.946876
C  7.67221 1.975657 1.395306
C  -0.464051 -1.725105 0.459222
C  -2.594554 -0.861814 0.040857
C  -2.380077 0.199603 -0.851802
C  -1.115899 0.955378 -0.920949
C  -0.52402 1.483989 0.224949
C  -0.514308 1.159243 -2.161276
C  -3.805513 -1.494682 0.043825
C  0.652031 2.214101 0.125284
C  0.665034 1.880475 -2.25436
C  1.248977 2.412482 -1.112097
C  -4.732952 -1.014202 -0.872448
H  5.121391 0.42022 0.300787
H  3.714098 1.345058 -0.174024
H  5.130931 1.558487 2.522698
H  3.677466 2.425576 2.098234
H  2.445907 0.32115 1.75476
H  3.856308 -0.643897 2.139116
H  5.620869 3.874325 1.84789
H  4.813828 3.64412 0.313439
H  2.258167 -0.761545 -0.464968
H  3.75032 -1.634906 -0.195847
H  6.553426 2.077397 -0.436122
H  7.246261 3.598263 0.058676
H  1.908986 -3.169585 0.224827
H  2.757322 -2.848707 1.724965
H  7.868059 2.569178 2.290983
H  8.633764 1.765611 0.924803
H  7.25718 1.020043 1.720023
H  -0.990904 1.357545 1.193315
H  -0.963398 0.742315 -3.053263
H  -4.021265 -2.317075 0.712007
H  1.100407 2.631747 1.017261
H  1.128318 2.027213 -3.220987
H  2.167592 2.979934 -1.185782
elementType: Cl S O N C H
totalener: -1856.32223452 hartree
nucrepener: 2472.93563933 hartree
electener: -4329.25787385 hartree
oneelecener: -7457.87136134 hartree
twoeener: 3128.61348749 hartree
cpcmener: -0.02984649 hartree
kineticenergy: 1850.61880152 hartree
xcener: -138.239451672157 hartree
chargesum: -0.0000000
charge: -0.045795 -0.044994 -0.284802 -0.398973 -0.147261 -0.202907 -0.172536 -0.121131 -0.134845 -0.152857 -0.116901 -0.109343 -0.131662 -0.280314 0.364331 0.181621 0.252110 0.023041 -0.169490 -0.181335 -0.134228 -0.197355 -0.167448 -0.129640 0.152672 0.080743 0.071871 0.075114 0.075292 0.057120 0.088921 0.075728 0.067904 0.065268 0.090589 0.060559 0.070966 0.131965 0.131946 0.082601 0.092974 0.077734 0.159586 0.143192 0.157192 0.162999 0.159438 0.170336
qa: -0.0458 -0.0450 -0.2848 -0.3990 -0.1473 -0.2029 -0.1725 -0.1211 -0.1348 -0.1529 -0.1169 -0.1093 -0.1317 -0.2803 0.3643 0.1816 0.2521 0.0230 -0.1695 -0.1813 -0.1342 -0.1974 -0.1674 -0.1296 0.1527 0.0807 0.0719 0.0751 0.0753 0.0571 0.0889 0.0757 0.0679 0.0653 0.0906 0.0606 0.0710 0.1320 0.1319 0.0826 0.0930 0.0777 0.1596 0.1432 0.1572 0.1630 0.1594 0.1703
va: 1.2577 2.4068 2.1208 2.1003 2.9474 2.9360 3.8736 3.8487 3.8397 3.9051 3.8555 3.8698 3.8927 3.9307 4.2659 3.8651 3.8169 3.5511 3.8620 3.9808 4.0416 3.8638 3.9390 3.8291 4.2117 1.0104 1.0100 1.0027 1.0124 1.0198 1.0113 1.0070 1.0122 1.0185 1.0112 1.0025 1.0078 1.0212 1.0078 1.0007 1.0048 0.9972 1.0076 1.0158 1.0053 0.9921 0.9931 0.9844
dispcorr: -0.026785540 hartree
energy: -1856.349020056148
dipole: 83.34252 -80.95621 2.38631 23.77849 -24.50340 -0.72491 12.58122 -10.67682 1.90440
magnitude: 3.13795 au
magnitude: 7.97603 debye
