program: Orca
programVersion: 5.0.2
elementType: Cl S O O N N C C C C C C C C C C C C C C C C C C C H H H H H H H H H H H H H H H H H H H H H H H
charge: 0
multiplicity: 1
keywords: wb97x-d3
keywords: def2-TZVPP
keywords: def2/J RIJCOSX
keywords: DEFGRID2
keywords: scfconv7
keywords: smallprint printgap noloewdin
keywords: NOSOSCF
formula: C19H23ClN2O2S
InChI: InChI=1/C19H23ClN2O2S/c1-2-3-4-5-6-10-13-25-19(23)24-16-14-17(20)21-22-18(16)15-11-8-7-9-12-15/h7-9,11-12,14H,2-6,10,13H2,1H3
48 atoms
Cl -6.375396 -1.542325 -0.144274
S  0.81296 -2.662821 0.897505
O  -1.354624 -1.997512 -0.171001
O  -0.715429 -0.549686 1.429356
N  -3.502478 0.689936 -1.302938
N  -4.689033 0.209159 -1.014611
C  3.798918 0.919116 0.307239
C  4.630397 1.599935 1.387779
C  2.605221 0.130833 0.836344
C  5.743966 2.470299 0.821668
C  3.005702 -1.091224 1.649886
C  6.559437 3.175784 1.897247
C  1.844514 -1.905961 2.19326
C  7.6611 4.054954 1.325978
C  -0.514013 -1.53924 0.789056
C  -2.47188 -1.256656 -0.447896
C  -2.397008 0.005656 -1.05531
C  -1.127581 0.650326 -1.436957
C  -0.160358 -0.035284 -2.16981
C  -0.910219 1.98302 -1.09099
C  -3.698017 -1.779532 -0.148143
C  1.006165 0.610286 -2.554311
C  0.260469 2.62027 -1.46971
C  1.219296 1.936756 -2.205859
C  -4.786398 -0.97968 -0.474827
H  4.438391 0.255379 -0.285061
H  3.432817 1.682411 -0.385861
H  5.067975 0.852069 2.05643
H  3.971616 2.215666 2.010262
H  1.995428 -0.186904 -0.014339
H  1.973526 0.788255 1.442025
H  5.312267 3.217689 0.146765
H  6.410346 1.855926 0.206296
H  3.652244 -1.737147 1.049044
H  3.59815 -0.79094 2.518592
H  5.891066 3.782729 2.515519
H  6.99748 2.429918 2.567506
H  2.212411 -2.749349 2.777957
H  1.199272 -1.319744 2.847303
H  8.366778 3.47103 0.732006
H  8.228736 4.551524 2.114066
H  7.251539 4.83165 0.67715
H  -0.323413 -1.062473 -2.46941
H  -1.654307 2.519022 -0.516621
H  -3.808493 -2.746698 0.32283
H  1.748344 0.074838 -3.131049
H  0.422375 3.653216 -1.191555
H  2.130588 2.436797 -2.506231
elementType: Cl S O N C H
totalener: -1856.32279557 hartree
nucrepener: 2449.24276046 hartree
electener: -4305.56555602 hartree
oneelecener: -7410.81627241 hartree
twoeener: 3105.25071638 hartree
cpcmener: -0.02989412 hartree
kineticenergy: 1850.61584882 hartree
xcener: -138.237059848917 hartree
chargesum: -0.0000000
charge: -0.045713 -0.047950 -0.287775 -0.400955 -0.149281 -0.201828 -0.127753 -0.106878 -0.104687 -0.117484 -0.122863 -0.075093 -0.119200 -0.284214 0.363639 0.170417 0.254924 0.032075 -0.175775 -0.193299 -0.124896 -0.154825 -0.142139 -0.170818 0.153656 0.067558 0.072849 0.062892 0.056640 0.030571 0.072713 0.056694 0.056095 0.076127 0.082436 0.052794 0.054535 0.134770 0.116809 0.077776 0.089953 0.077657 0.155127 0.143635 0.156052 0.157407 0.160165 0.167454
qa: -0.0457 -0.0479 -0.2878 -0.4010 -0.1493 -0.2018 -0.1278 -0.1069 -0.1047 -0.1175 -0.1229 -0.0751 -0.1192 -0.2842 0.3636 0.1704 0.2549 0.0321 -0.1758 -0.1933 -0.1249 -0.1548 -0.1421 -0.1708 0.1537 0.0676 0.0728 0.0629 0.0566 0.0306 0.0727 0.0567 0.0561 0.0761 0.0824 0.0528 0.0545 0.1348 0.1168 0.0778 0.0900 0.0777 0.1551 0.1436 0.1561 0.1574 0.1602 0.1675
va: 1.2577 2.4076 2.1186 2.0926 2.9490 2.9364 3.9171 3.8821 3.8684 3.8916 3.9049 3.8719 3.8897 3.9481 4.2626 3.8680 3.8058 3.5381 3.8570 3.9867 4.0484 3.8420 3.8884 3.8536 4.2104 1.0091 1.0128 1.0100 1.0097 1.0429 1.0126 1.0090 1.0082 1.0125 1.0132 1.0072 1.0072 1.0071 1.0281 1.0004 1.0041 1.0008 1.0079 1.0168 1.0056 0.9955 0.9919 0.9862
dispcorr: -0.025360206 hartree
energy: -1856.348155771422
dipole: 82.18280 -79.56532 2.61748 28.46002 -30.05627 -1.59625 12.67624 -11.91083 0.76540
magnitude: 3.15991 au
magnitude: 8.03186 debye
