program: Orca
programVersion: 5.0.2
elementType: Cl S O O N N C C C C C C C C C C C C C C C C C C C H H H H H H H H H H H H H H H H H H H H H H H
charge: 0
multiplicity: 1
keywords: wb97x-d3
keywords: def2-TZVPP
keywords: def2/J RIJCOSX
keywords: DEFGRID2
keywords: scfconv7
keywords: smallprint printgap noloewdin
keywords: NOSOSCF
formula: C19H23ClN2O2S
InChI: InChI=1/C19H23ClN2O2S/c1-2-3-4-5-6-10-13-25-19(23)24-16-14-17(20)21-22-18(16)15-11-8-7-9-12-15/h7-9,11-12,14H,2-6,10,13H2,1H3
48 atoms
Cl -6.315038 -0.66678 0.515519
S  0.83507 -2.79285 0.590051
O  -1.496939 -2.066173 -0.009528
O  -0.306909 -0.427323 0.975373
N  -3.360306 0.645585 -1.5144
N  -4.543466 0.47986 -0.969987
C  3.816488 0.937303 1.315087
C  5.047327 1.790782 1.591424
C  4.101254 -0.213842 0.358582
C  4.776458 2.94373 2.548199
C  2.864259 -1.011777 -0.042992
C  5.999959 3.813592 2.805435
C  2.27849 -1.815991 1.107669
C  5.724788 4.948528 3.779829
C  -0.382525 -1.547565 0.564247
C  -2.518009 -1.209281 -0.314159
C  -2.351269 -0.161485 -1.234523
C  -1.072372 0.113324 -1.915569
C  -0.375471 -0.898953 -2.572891
C  -0.558243 1.408621 -1.908105
C  -3.742454 -1.402317 0.259676
C  0.820173 -0.614061 -3.216215
C  0.641056 1.686084 -2.544673
C  1.332498 0.675411 -3.2000
C  -4.73226 -0.508564 -0.133207
H  3.02612 1.566405 0.891083
H  3.425715 0.554049 2.262936
H  5.430868 2.187296 0.645033
H  5.843372 1.159267 2.000594
H  4.847037 -0.885354 0.796608
H  4.553671 0.187505 -0.552866
H  4.408241 2.545611 3.499959
H  3.969034 3.566146 2.147254
H  2.110234 -0.329534 -0.443796
H  3.122629 -1.699249 -0.85129
H  6.813279 3.191161 3.190706
H  6.356401 4.225167 1.856258
H  2.993794 -2.557135 1.468719
H  1.993336 -1.204046 1.962585
H  4.935655 5.606082 3.4100
H  6.611939 5.561445 3.944225
H  5.404684 4.566829 4.751111
H  -0.7726 -1.905216 -2.607986
H  -1.089738 2.196771 -1.390876
H  -3.924649 -2.191501 0.976102
H  1.351016 -1.403474 -3.731138
H  1.036309 2.693068 -2.527573
H  2.268659 0.893421 -3.696879
elementType: Cl S O N C H
totalener: -1856.32329852 hartree
nucrepener: 2431.05158607 hartree
electener: -4287.37488458 hartree
oneelecener: -7374.35431444 hartree
twoeener: 3086.97942985 hartree
cpcmener: -0.02974728 hartree
kineticenergy: 1850.61500982 hartree
xcener: -138.235072347842 hartree
chargesum: -0.0000000
charge: -0.045928 -0.045387 -0.284244 -0.396353 -0.147299 -0.202202 -0.105215 -0.117643 -0.122970 -0.103294 -0.117869 -0.079812 -0.107488 -0.282700 0.359506 0.180847 0.253725 0.015418 -0.158780 -0.177655 -0.134413 -0.196348 -0.170616 -0.120161 0.153511 0.058696 0.060728 0.057797 0.058571 0.071682 0.074150 0.055221 0.056080 0.022394 0.097611 0.053908 0.053776 0.132259 0.116695 0.077634 0.089919 0.077531 0.159303 0.143748 0.156588 0.157581 0.159453 0.162046
qa: -0.0459 -0.0454 -0.2842 -0.3964 -0.1473 -0.2022 -0.1052 -0.1176 -0.1230 -0.1033 -0.1179 -0.0798 -0.1075 -0.2827 0.3595 0.1808 0.2537 0.0154 -0.1588 -0.1777 -0.1344 -0.1963 -0.1706 -0.1202 0.1535 0.0587 0.0607 0.0578 0.0586 0.0717 0.0742 0.0552 0.0561 0.0224 0.0976 0.0539 0.0538 0.1323 0.1167 0.0776 0.0899 0.0775 0.1593 0.1437 0.1566 0.1576 0.1595 0.1620
va: 1.2574 2.4149 2.1213 2.0991 2.9497 2.9369 3.8733 3.8941 3.9207 3.8760 3.9183 3.8760 3.8887 3.9478 4.2662 3.8688 3.8166 3.5502 3.8491 3.9639 4.0420 3.8840 3.9056 3.8230 4.2132 1.0092 1.0112 1.0108 1.0099 1.0091 1.0115 1.0090 1.0088 1.0305 1.0128 1.0070 1.0071 1.0098 1.0249 1.0006 1.0041 1.0007 1.0066 1.0156 1.0054 0.9948 0.9920 0.9886
dispcorr: -0.024517250 hartree
energy: -1856.347815765818
dipole: 78.53580 -75.98963 2.54617 27.77334 -29.53079 -1.75745 16.02261 -15.50652 0.51610
magnitude: 3.13655 au
magnitude: 7.97248 debye
