program: Orca
programVersion: 5.0.2
elementType: Cl S O O N N C C C C C C C C C C C C C C C C C C C H H H H H H H H H H H H H H H H H H H H H H H
charge: 0
multiplicity: 1
keywords: wb97x-d3
keywords: def2-TZVPP
keywords: def2/J RIJCOSX
keywords: DEFGRID2
keywords: scfconv7
keywords: smallprint printgap noloewdin
keywords: NOSOSCF
formula: C19H23ClN2O2S
InChI: InChI=1/C19H23ClN2O2S/c1-2-3-4-5-6-10-13-25-19(23)24-16-14-17(20)21-22-18(16)15-11-8-7-9-12-15/h7-9,11-12,14H,2-6,10,13H2,1H3
48 atoms
Cl -5.314734 -1.270972 -2.426101
S  0.178216 -2.136504 -0.757731
O  -1.744022 -2.153516 1.026529
O  0.126911 -3.06708 1.719991
N  -2.753696 0.904454 -0.614511
N  -3.714405 0.472914 -1.396306
C  3.874395 0.628247 0.110158
C  4.086768 1.919629 -0.667795
C  3.007909 -0.378279 -0.633163
C  4.850795 2.974843 0.119772
C  2.777762 -1.65422 0.163142
C  5.055741 4.271499 -0.651738
C  1.906691 -2.671345 -0.552554
C  5.805485 5.324964 0.148896
C  -0.447447 -2.505823 0.835503
C  -2.387199 -1.285282 0.191244
C  -2.084777 0.087542 0.183588
C  -1.015162 0.692301 0.998345
C  -0.827146 0.348626 2.33709
C  -0.186273 1.653886 0.418824
C  -3.390073 -1.754625 -0.611164
C  0.186018 0.944901 3.073581
C  0.821279 2.248736 1.160006
C  1.014598 1.890919 2.488163
C  -4.028972 -0.797932 -1.390749
H  3.408459 0.858049 1.074166
H  4.844862 0.177227 0.342751
H  3.113882 2.327076 -0.964492
H  4.618803 1.700815 -1.599814
H  3.473574 -0.628925 -1.591861
H  2.045839 0.087159 -0.872632
H  5.824901 2.57335 0.419727
H  4.312178 3.18959 1.049927
H  3.738477 -2.139933 0.358674
H  2.351582 -1.417488 1.141553
H  5.599141 4.060276 -1.577764
H  4.082211 4.668527 -0.955548
H  2.256325 -2.835747 -1.573527
H  1.905554 -3.640414 -0.055899
H  5.269556 5.58312 1.064301
H  5.939642 6.244349 -0.422701
H  6.796964 4.971573 0.438492
H  -1.481098 -0.362466 2.823387
H  -0.320208 1.926601 -0.619524
H  -3.660151 -2.801413 -0.636719
H  0.320015 0.672231 4.111848
H  1.461919 2.988045 0.697295
H  1.806897 2.350665 3.064188
elementType: Cl S O N C H
totalener: -1856.32005345 hartree
nucrepener: 2510.65544866 hartree
electener: -4366.97550210 hartree
oneelecener: -7532.94284936 hartree
twoeener: 3165.96734726 hartree
cpcmener: -0.02988008 hartree
kineticenergy: 1850.60639525 hartree
xcener: -138.236861010856 hartree
chargesum: 0.0000000
charge: -0.043266 -0.058323 -0.266634 -0.400561 -0.143240 -0.202675 -0.122208 -0.144304 -0.138075 -0.115727 -0.134741 -0.077556 -0.105690 -0.283816 0.348086 0.082940 0.284568 0.028832 -0.189188 -0.207584 -0.083950 -0.147689 -0.168953 -0.141414 0.153208 0.055907 0.088043 0.058780 0.076226 0.086756 0.052849 0.066685 0.056151 0.088767 0.074560 0.055176 0.054463 0.131705 0.132506 0.077785 0.090065 0.077305 0.157883 0.140817 0.162787 0.160281 0.167632 0.164830
qa: -0.0433 -0.0583 -0.2666 -0.4006 -0.1432 -0.2027 -0.1222 -0.1443 -0.1381 -0.1157 -0.1347 -0.0776 -0.1057 -0.2838 0.3481 0.0829 0.2846 0.0288 -0.1892 -0.2076 -0.0839 -0.1477 -0.1690 -0.1414 0.1532 0.0559 0.0880 0.0588 0.0762 0.0868 0.0528 0.0667 0.0562 0.0888 0.0746 0.0552 0.0545 0.1317 0.1325 0.0778 0.0901 0.0773 0.1579 0.1408 0.1628 0.1603 0.1676 0.1648
va: 1.2604 2.4055 2.1114 2.0946 2.9480 2.9352 3.8612 3.8740 3.8471 3.8686 3.8892 3.8722 3.8649 3.9483 4.3188 3.9317 3.7663 3.5480 3.8757 3.9225 4.0087 3.8900 3.8603 3.8537 4.2128 1.0129 1.0105 1.0057 1.0118 1.0138 1.0231 1.0095 1.0083 1.0129 1.0145 1.0071 1.0066 1.0084 1.0225 1.0004 1.0041 1.0007 1.0131 1.0246 1.0033 0.9913 0.9821 0.9899
dispcorr: -0.026958063 hartree
energy: -1856.347011508257
dipole: 70.72436 -68.98228 1.74208 30.55373 -31.48254 -0.92880 8.45808 -8.53512 -0.07704
magnitude: 1.97572 au
magnitude: 5.02187 debye
