program: Orca
programVersion: 5.0.2
elementType: Cl S O O N N C C C C C C C C C C C C C C C C C C C H H H H H H H H H H H H H H H H H H H H H H H
charge: 0
multiplicity: 1
keywords: wb97x-d3
keywords: def2-TZVPP
keywords: def2/J RIJCOSX
keywords: DEFGRID2
keywords: scfconv7
keywords: smallprint printgap noloewdin
keywords: NOSOSCF
formula: C19H23ClN2O2S
InChI: InChI=1/C19H23ClN2O2S/c1-2-3-4-5-6-10-13-25-19(23)24-16-14-17(20)21-22-18(16)15-11-8-7-9-12-15/h7-9,11-12,14H,2-6,10,13H2,1H3
48 atoms
Cl -6.366432 -1.340415 -0.075561
S  0.868322 -2.911253 0.263663
O  -1.379585 -1.988575 -0.354593
O  -0.505676 -0.977503 1.460287
N  -3.406616 0.996415 -0.667622
N  -4.610171 0.50734 -0.485323
C  4.811795 0.434139 1.495527
C  4.066304 1.748302 1.293513
C  3.930513 -0.702478 2.006676
C  4.946274 2.898635 0.812998
C  2.852588 -1.113356 1.009335
C  5.536219 2.69934 -0.579078
C  2.107949 -2.354292 1.4693
C  6.336851 3.90331 -1.052874
C  -0.42171 -1.78538 0.583106
C  -2.457069 -1.148005 -0.38362
C  -2.330534 0.226016 -0.642411
C  -1.039392 0.897767 -0.878599
C  -0.101284 0.376821 -1.768409
C  -0.765053 2.094034 -0.217353
C  -3.702876 -1.679002 -0.199448
C  1.093282 1.046961 -1.990423
C  0.430518 2.757549 -0.439963
C  1.36194 2.236584 -1.328751
C  -4.75636 -0.776938 -0.277668
H  5.631139 0.596178 2.202932
H  5.279243 0.117428 0.558294
H  3.592685 2.031477 2.239136
H  3.249431 1.609737 0.579239
H  3.464325 -0.414505 2.954357
H  4.560901 -1.569499 2.225936
H  5.758727 3.062673 1.52957
H  4.353185 3.81884 0.813177
H  2.145063 -0.295559 0.858417
H  3.313288 -1.312468 0.037878
H  6.178358 1.814943 -0.592024
H  4.726204 2.496456 -1.28766
H  2.787065 -3.203421 1.566653
H  1.624562 -2.219213 2.437086
H  6.764014 3.737697 -2.042801
H  7.161948 4.122104 -0.372363
H  5.713407 4.797599 -1.109703
H  -0.30668 -0.534555 -2.315031
H  -1.484131 2.500842 0.481404
H  -3.852331 -2.731066 0.001756
H  1.81272 0.640103 -2.688378
H  0.636168 3.682415 0.082455
H  2.295382 2.756251 -1.503698
elementType: Cl S O N C H
totalener: -1856.32243901 hartree
nucrepener: 2474.02274151 hartree
electener: -4330.34518052 hartree
oneelecener: -7460.12847003 hartree
twoeener: 3129.78328951 hartree
cpcmener: -0.02978538 hartree
kineticenergy: 1850.61242095 hartree
xcener: -138.236988592734 hartree
chargesum: -0.0000000
charge: -0.045957 -0.043503 -0.283672 -0.398750 -0.146127 -0.203397 -0.133650 -0.058018 -0.155214 -0.156817 -0.102446 -0.082808 -0.107554 -0.285536 0.357972 0.178601 0.251436 0.000833 -0.149840 -0.163721 -0.132184 -0.209944 -0.178876 -0.119209 0.153698 0.075112 0.066951 0.079011 0.002610 0.071920 0.078921 0.065211 0.072953 0.049062 0.077053 0.065328 0.053950 0.131830 0.117923 0.090408 0.079104 0.078690 0.161489 0.142780 0.156149 0.155689 0.159370 0.183170
qa: -0.0460 -0.0435 -0.2837 -0.3988 -0.1461 -0.2034 -0.1337 -0.0580 -0.1552 -0.1568 -0.1024 -0.0828 -0.1076 -0.2855 0.3580 0.1786 0.2514 0.0008 -0.1498 -0.1637 -0.1322 -0.2099 -0.1789 -0.1192 0.1537 0.0751 0.0670 0.0790 0.0026 0.0719 0.0789 0.0652 0.0730 0.0491 0.0771 0.0653 0.0539 0.1318 0.1179 0.0904 0.0791 0.0787 0.1615 0.1428 0.1561 0.1557 0.1594 0.1832
va: 1.2575 2.4159 2.1227 2.0969 2.9459 2.9366 3.9059 3.8733 3.9462 3.9040 3.8627 3.8499 3.8838 3.9470 4.2682 3.8729 3.8187 3.5576 3.8422 3.9647 4.0410 3.8921 3.9266 3.8041 4.2116 1.0120 1.0076 1.0114 1.0334 1.0098 1.0099 1.0091 1.0070 1.0196 1.0136 1.0078 1.0059 1.0092 1.0228 1.0035 1.0006 1.0010 1.0047 1.0168 1.0057 0.9973 0.9943 0.9733
dispcorr: -0.026151016 hartree
energy: -1856.348590026158
dipole: 79.25897 -76.64093 2.61804 25.79097 -27.52486 -1.73388 6.29785 -6.20514 0.09271
magnitude: 3.14151 au
magnitude: 7.98509 debye
