program: Orca
programVersion: 5.0.2
elementType: Cl S O O N N C C C C C C C C C C C C C C C C C C C H H H H H H H H H H H H H H H H H H H H H H H
charge: 0
multiplicity: 1
keywords: wb97x-d3
keywords: def2-TZVPP
keywords: def2/J RIJCOSX
keywords: DEFGRID2
keywords: scfconv7
keywords: smallprint printgap noloewdin
keywords: NOSOSCF
formula: C19H23ClN2O2S
InChI: InChI=1/C19H23ClN2O2S/c1-2-3-4-5-6-10-13-25-19(23)24-16-14-17(20)21-22-18(16)15-11-8-7-9-12-15/h7-9,11-12,14H,2-6,10,13H2,1H3
48 atoms
Cl -5.818053 -1.555926 -1.582011
S  0.87178 -2.645753 1.275413
O  -1.35165 -1.631828 0.760826
O  0.067345 -1.473368 -0.979351
N  -3.1826 1.085614 -0.774882
N  -4.254069 0.463632 -1.205652
C  3.67486 -0.132619 -0.0280
C  4.124932 1.307713 0.173227
C  3.706534 -0.943201 1.26271
C  4.004941 2.15039 -1.090047
C  3.620262 -2.448656 1.05146
C  4.361518 3.620952 -0.89732
C  2.387126 -2.932491 0.304557
C  5.81018 3.855641 -0.493731
C  -0.159564 -1.819731 0.142861
C  -2.31838 -0.935415 0.087293
C  -2.217228 0.445963 -0.132647
C  -1.069216 1.262005 0.302781
C  -0.528442 1.137527 1.582568
C  -0.546585 2.215379 -0.570553
C  -3.428933 -1.60223 -0.347906
C  0.514305 1.961804 1.98026
C  0.497516 3.033387 -0.169738
C  1.026444 2.912166 1.108341
C  -4.380434 -0.822316 -0.993741
H  4.317447 -0.60924 -0.776941
H  2.663081 -0.13841 -0.446877
H  5.159375 1.307011 0.53004
H  3.530287 1.765006 0.971301
H  2.902138 -0.606574 1.924538
H  4.638639 -0.736817 1.796706
H  2.978466 2.081032 -1.464252
H  4.64111 1.723839 -1.873746
H  4.483483 -2.780532 0.466785
H  3.69326 -2.964389 2.012307
H  4.158482 4.159135 -1.827109
H  3.697833 4.05891 -0.144503
H  2.277203 -2.443941 -0.662301
H  2.444901 -4.005105 0.124949
H  6.037136 4.921118 -0.436699
H  6.497777 3.412287 -1.217122
H  6.03834 3.424638 0.481875
H  -0.938057 0.428306 2.289543
H  -0.95326 2.313946 -1.568231
H  -3.550173 -2.667251 -0.204658
H  0.918081 1.868289 2.979556
H  0.89769 3.768463 -0.855596
H  1.837039 3.55629 1.422617
elementType: Cl S O N C H
totalener: -1856.32056802 hartree
nucrepener: 2513.07899035 hartree
electener: -4369.39955837 hartree
oneelecener: -7538.44531847 hartree
twoeener: 3169.04576010 hartree
cpcmener: -0.02921750 hartree
kineticenergy: 1850.61565132 hartree
xcener: -138.238815248464 hartree
chargesum: -0.0000000
charge: -0.045292 -0.042422 -0.287733 -0.405272 -0.148211 -0.201907 -0.107514 -0.154201 -0.128542 -0.143693 -0.147386 -0.108024 -0.133425 -0.279970 0.369835 0.168859 0.262997 0.021421 -0.174276 -0.156741 -0.122735 -0.196576 -0.206596 -0.119180 0.151802 0.077653 0.044368 0.085169 0.066574 0.064997 0.076339 0.073955 0.081221 0.083380 0.092317 0.072034 0.049822 0.120978 0.134654 0.091659 0.081502 0.080272 0.159631 0.142315 0.156191 0.158338 0.165392 0.176019
qa: -0.0453 -0.0424 -0.2877 -0.4053 -0.1482 -0.2019 -0.1075 -0.1542 -0.1285 -0.1437 -0.1474 -0.1080 -0.1334 -0.2800 0.3698 0.1689 0.2630 0.0214 -0.1743 -0.1567 -0.1227 -0.1966 -0.2066 -0.1192 0.1518 0.0777 0.0444 0.0852 0.0666 0.0650 0.0763 0.0740 0.0812 0.0834 0.0923 0.0720 0.0498 0.1210 0.1347 0.0917 0.0815 0.0803 0.1596 0.1423 0.1562 0.1583 0.1654 0.1760
va: 1.2582 2.4227 2.1107 2.0913 2.9478 2.9359 3.8292 3.8689 3.8576 3.8690 3.9006 3.8826 3.8906 3.9330 4.2619 3.8743 3.8090 3.5592 3.8603 3.9753 4.0467 3.8912 3.8966 3.7945 4.2106 1.0135 1.0168 1.0081 1.0078 1.0189 1.0157 1.0076 1.0091 1.0088 1.0110 1.0078 1.0123 1.0197 1.0072 1.0044 1.0003 0.9984 1.0066 1.0190 1.0048 0.9960 0.9906 0.9775
dispcorr: -0.027305369 hartree
energy: -1856.347873384604
dipole: 72.13153 -69.77128 2.36025 22.54008 -24.14176 -1.60169 5.56805 -4.13693 1.43113
magnitude: 3.19128 au
magnitude: 8.11160 debye
