program: Orca
programVersion: 5.0.2
elementType: Cl S O O N N C C C C C C C C C C C C C C C C C C C H H H H H H H H H H H H H H H H H H H H H H H
charge: 0
multiplicity: 1
keywords: wb97x-d3
keywords: def2-TZVPP
keywords: def2/J RIJCOSX
keywords: DEFGRID2
keywords: scfconv7
keywords: smallprint printgap noloewdin
keywords: NOSOSCF
formula: C19H23ClN2O2S
InChI: InChI=1/C19H23ClN2O2S/c1-2-3-4-5-6-10-13-25-19(23)24-16-14-17(20)21-22-18(16)15-11-8-7-9-12-15/h7-9,11-12,14H,2-6,10,13H2,1H3
48 atoms
Cl -6.473611 -0.947835 0.103178
S  0.733883 -2.794345 0.718968
O  -1.566743 -2.099646 -0.024494
O  -0.556887 -0.532205 1.237229
N  -3.389497 0.681694 -1.450791
N  -4.61387 0.415608 -1.057925
C  4.361659 1.02028 0.159661
C  5.513434 1.84701 0.722812
C  3.791752 -0.005468 1.132814
C  5.122905 2.744065 1.890826
C  2.658901 -0.806828 0.504243
C  6.264531 3.629801 2.373425
C  2.073461 -1.822322 1.469859
C  5.861272 4.530947 3.530068
C  -0.536912 -1.602665 0.705218
C  -2.588095 -1.252136 -0.352887
C  -2.376736 -0.111319 -1.144107
C  -1.048411 0.280005 -1.653654
C  -0.247198 -0.628712 -2.342718
C  -0.591981 1.581492 -1.451656
C  -3.854865 -1.548759 0.063738
C  0.993863 -0.236258 -2.82331
C  0.653342 1.965296 -1.924064
C  1.448847 1.057545 -2.611567
C  -4.841071 -0.660026 -0.347124
H  4.70177 0.498743 -0.740381
H  3.559513 1.691666 -0.166518
H  5.924428 2.469167 -0.078419
H  6.324128 1.178065 1.031595
H  3.420239 0.491392 2.033299
H  4.588251 -0.681716 1.460521
H  4.766783 2.137348 2.729105
H  4.277347 3.374618 1.593048
H  1.87969 -0.117916 0.170744
H  3.020384 -1.324285 -0.38793
H  7.107482 3.001143 2.676274
H  6.626662 4.241267 1.541341
H  2.81786 -2.566846 1.757524
H  1.706847 -1.363196 2.388143
H  5.044317 5.197209 3.24634
H  6.691885 5.154186 3.863898
H  5.523714 3.946708 4.388366
H  -0.596273 -1.636365 -2.528857
H  -1.205051 2.290749 -0.910914
H  -4.070558 -2.413772 0.675738
H  1.606228 -0.946123 -3.363103
H  1.003522 2.974885 -1.754091
H  2.421416 1.358031 -2.978542
elementType: Cl S O N C H
totalener: -1856.32316858 hartree
nucrepener: 2440.11387620 hartree
electener: -4296.43704477 hartree
oneelecener: -7392.40349990 hartree
twoeener: 3095.96645513 hartree
cpcmener: -0.02955905 hartree
kineticenergy: 1850.61341165 hartree
xcener: -138.235597596996 hartree
chargesum: 0.0000000
charge: -0.045798 -0.042476 -0.283410 -0.394393 -0.146479 -0.202740 -0.114602 -0.139005 -0.126216 -0.107065 -0.116782 -0.088004 -0.104412 -0.278089 0.354877 0.179737 0.256097 0.019869 -0.170951 -0.178169 -0.135025 -0.175443 -0.158175 -0.148284 0.153672 0.080637 0.053737 0.071149 0.062392 0.072898 0.068960 0.059187 0.057582 0.040534 0.080350 0.055024 0.054769 0.132077 0.117210 0.077627 0.090273 0.077019 0.158432 0.143714 0.156675 0.158320 0.160254 0.162445
qa: -0.0458 -0.0425 -0.2834 -0.3944 -0.1465 -0.2027 -0.1146 -0.1390 -0.1262 -0.1071 -0.1168 -0.0880 -0.1044 -0.2781 0.3549 0.1797 0.2561 0.0199 -0.1710 -0.1782 -0.1350 -0.1754 -0.1582 -0.1483 0.1537 0.0806 0.0537 0.0711 0.0624 0.0729 0.0690 0.0592 0.0576 0.0405 0.0803 0.0550 0.0548 0.1321 0.1172 0.0776 0.0903 0.0770 0.1584 0.1437 0.1567 0.1583 0.1603 0.1624
va: 1.2575 2.4151 2.1223 2.1033 2.9485 2.9367 3.8993 3.9300 3.9018 3.8584 3.8952 3.8833 3.9001 3.9440 4.2749 3.8720 3.8123 3.5439 3.8650 3.9665 4.0419 3.8629 3.8863 3.8326 4.2129 1.0076 1.0105 1.0105 1.0092 1.0069 1.0109 1.0078 1.0074 1.0249 1.0131 1.0064 1.0080 1.0090 1.0233 1.0007 1.0042 1.0013 1.0068 1.0152 1.0054 0.9944 0.9925 0.9885
dispcorr: -0.025311565 hartree
energy: -1856.348480143083
dipole: 81.07848 -78.50989 2.56859 28.53035 -30.21669 -1.68633 15.32670 -14.73310 0.59361
magnitude: 3.12950 au
magnitude: 7.95456 debye
