program: Orca
programVersion: 5.0.2
elementType: Cl S O O N N C C C C C C C C C C C C C C C C C C C H H H H H H H H H H H H H H H H H H H H H H H
charge: 0
multiplicity: 1
keywords: wb97x-d3
keywords: def2-TZVPP
keywords: def2/J RIJCOSX
keywords: DEFGRID2
keywords: scfconv7
keywords: smallprint printgap noloewdin
keywords: NOSOSCF
formula: C19H23ClN2O2S
InChI: InChI=1/C19H23ClN2O2S/c1-2-3-4-5-6-10-13-25-19(23)24-16-14-17(20)21-22-18(16)15-11-8-7-9-12-15/h7-9,11-12,14H,2-6,10,13H2,1H3
48 atoms
Cl -6.098578 -1.555029 -0.330542
S  1.157996 -2.344576 0.701791
O  -1.054927 -1.63459 -0.239263
O  -0.624037 -0.665985 1.745187
N  -3.378636 1.102372 -0.687357
N  -4.531459 0.479966 -0.597899
C  3.689714 1.551266 1.752473
C  4.941023 1.258229 0.929108
C  2.605653 0.476748 1.697128
C  4.681863 1.056068 -0.558023
C  3.109995 -0.900795 2.101164
C  5.95832 0.823922 -1.355423
C  2.030469 -1.957535 2.253535
C  5.698792 0.617178 -2.839416
C  -0.29191 -1.393808 0.856248
C  -2.22488 -0.932753 -0.354061
C  -2.232372 0.450334 -0.585415
C  -0.998458 1.247221 -0.711421
C  0.007758 0.870094 -1.599092
C  -0.84802 2.405695 0.047785
C  -3.41246 -1.60098 -0.263883
C  1.145869 1.651888 -1.730618
C  0.296339 3.177772 -0.079656
C  1.292442 2.804815 -0.971816
C  -4.550206 -0.815338 -0.40821
H  3.257919 2.501113 1.421677
H  3.983893 1.701071 2.795926
H  5.454386 0.378375 1.330116
H  5.640966 2.090005 1.057003
H  2.177513 0.432381 0.691387
H  1.789646 0.774637 2.361307
H  4.161155 1.933104 -0.958018
H  4.006548 0.207241 -0.71136
H  3.858088 -1.257347 1.388887
H  3.618313 -0.836292 3.06877
H  6.632012 1.674949 -1.216032
H  6.48344 -0.04695 -0.951205
H  2.467135 -2.906653 2.565456
H  1.289015 -1.683589 3.00392
H  5.060397 -0.251363 -3.012538
H  6.62563 0.458244 -3.392233
H  5.19879 1.482887 -3.278283
H  -0.103181 -0.017406 -2.208365
H  -1.621289 2.69729 0.746295
H  -3.459844 -2.665814 -0.080341
H  1.920059 1.357664 -2.426822
H  0.409798 4.072197 0.518224
H  2.184243 3.409384 -1.071833
elementType: Cl S O N C H
totalener: -1856.32199903 hartree
nucrepener: 2525.51199047 hartree
electener: -4381.83398950 hartree
oneelecener: -7563.25235827 hartree
twoeener: 3181.41836877 hartree
cpcmener: -0.03000061 hartree
kineticenergy: 1850.61872327 hartree
xcener: -138.240045290495 hartree
chargesum: -0.0000000
charge: -0.045834 -0.043615 -0.288493 -0.401770 -0.150132 -0.200434 -0.167866 -0.123883 -0.083379 -0.115330 -0.135910 -0.085882 -0.116448 -0.279519 0.364550 0.174598 0.250451 0.037282 -0.178150 -0.192073 -0.127657 -0.155294 -0.154083 -0.155140 0.153033 0.077259 0.085867 0.067882 0.076099 0.002268 0.087669 0.055171 0.052672 0.079248 0.085812 0.055544 0.056727 0.133996 0.115775 0.078087 0.093161 0.077305 0.154459 0.143795 0.157043 0.157490 0.159068 0.168581
qa: -0.0458 -0.0436 -0.2885 -0.4018 -0.1501 -0.2004 -0.1679 -0.1239 -0.0834 -0.1153 -0.1359 -0.0859 -0.1164 -0.2795 0.3645 0.1746 0.2505 0.0373 -0.1781 -0.1921 -0.1277 -0.1553 -0.1541 -0.1551 0.1530 0.0773 0.0859 0.0679 0.0761 0.0023 0.0877 0.0552 0.0527 0.0792 0.0858 0.0555 0.0567 0.1340 0.1158 0.0781 0.0932 0.0773 0.1545 0.1438 0.1570 0.1575 0.1591 0.1686
va: 1.2575 2.4104 2.1181 2.0919 2.9512 2.9365 3.9241 3.8765 3.8165 3.8657 3.9050 3.8925 3.8913 3.9398 4.2632 3.8600 3.8089 3.5549 3.8836 3.9717 4.0540 3.8434 3.8944 3.8184 4.2124 1.0082 1.0074 1.0019 1.0102 1.0301 1.0158 1.0103 1.0012 1.0069 1.0114 1.0080 1.0075 1.0078 1.0284 1.0007 1.0049 1.0006 1.0081 1.0156 1.0051 0.9925 0.9933 0.9848
dispcorr: -0.028192778 hartree
energy: -1856.350191807011
dipole: 74.41214 -71.65723 2.75491 16.66092 -18.21101 -1.55010 2.15683 -1.68900 0.46783
magnitude: 3.19550 au
magnitude: 8.12231 debye
