program: Orca
programVersion: 5.0.2
elementType: Cl S O O N N C C C C C C C C C C C C C C C C C C C H H H H H H H H H H H H H H H H H H H H H H H
charge: 0
multiplicity: 1
keywords: wb97x-d3
keywords: def2-TZVPP
keywords: def2/J RIJCOSX
keywords: DEFGRID2
keywords: scfconv7
keywords: smallprint printgap noloewdin
keywords: NOSOSCF
formula: C19H23ClN2O2S
InChI: InChI=1/C19H23ClN2O2S/c1-2-3-4-5-6-10-13-25-19(23)24-16-14-17(20)21-22-18(16)15-11-8-7-9-12-15/h7-9,11-12,14H,2-6,10,13H2,1H3
48 atoms
Cl -5.936598 -0.388487 0.925623
S  1.0036 -2.997665 0.212464
O  -1.266962 -1.97383 -0.121276
O  0.056942 -0.720677 1.19885
N  -2.937279 1.14808 -0.869636
N  -4.117426 0.944419 -0.331698
C  4.430775 -0.103592 1.991497
C  3.483288 1.092403 2.033465
C  4.523144 -0.811687 0.64112
C  3.840406 2.207946 1.059492
C  3.192259 -1.292782 0.068996
C  2.958466 3.439858 1.215812
C  2.517298 -2.324234 0.958006
C  3.363774 4.579263 0.293709
C  -0.107373 -1.694454 0.524099
C  -2.219569 -0.9938 -0.178197
C  -1.987585 0.227859 -0.828639
C  -0.701529 0.57405 -1.462075
C  -0.059694 -0.308139 -2.330019
C  -0.120953 1.811911 -1.190717
C  -3.442594 -1.22909 0.38325
C  1.150757 0.043943 -2.909851
C  1.088094 2.158622 -1.772472
C  1.729494 1.273784 -2.629775
C  -4.365102 -0.197808 0.259106
H  4.131414 -0.819373 2.762735
H  5.434903 0.227954 2.273142
H  3.487032 1.496782 3.050573
H  2.454448 0.764879 1.85165
H  5.200004 -1.666037 0.736765
H  4.985754 -0.147426 -0.093431
H  3.766611 1.84766 0.02753
H  4.888635 2.493319 1.205105
H  2.524534 -0.443905 -0.095502
H  3.368574 -1.736268 -0.913484
H  1.91599 3.164445 1.026706
H  2.995469 3.78287 2.254387
H  3.159472 -3.196717 1.097134
H  2.275935 -1.945562 1.950777
H  2.700375 5.438755 0.399528
H  3.340098 4.274129 -0.754557
H  4.378548 4.919888 0.508693
H  -0.509527 -1.260471 -2.579366
H  -0.607678 2.501337 -0.513405
H  -3.669439 -2.153709 0.896276
H  1.639301 -0.645039 -3.585944
H  1.530076 3.121879 -1.55489
H  2.675464 1.545131 -3.079944
elementType: Cl S O N C H
totalener: -1856.32231490 hartree
nucrepener: 2549.68124755 hartree
electener: -4406.00356244 hartree
oneelecener: -7611.63163845 hartree
twoeener: 3205.62807600 hartree
cpcmener: -0.02935416 hartree
kineticenergy: 1850.60793908 hartree
xcener: -138.238402323078 hartree
chargesum: -0.0000000
charge: -0.045640 -0.042891 -0.284166 -0.400901 -0.146279 -0.204003 -0.165434 -0.096676 -0.151872 -0.125842 -0.095700 -0.105488 -0.115123 -0.286558 0.366051 0.172726 0.254263 0.017331 -0.161383 -0.158908 -0.130872 -0.195279 -0.223758 -0.108128 0.153958 0.080006 0.075539 0.075806 0.052416 0.084979 0.082934 0.049912 0.070962 0.009580 0.096936 0.053702 0.069653 0.135736 0.119731 0.094653 0.072698 0.088086 0.161699 0.143600 0.156286 0.158462 0.187028 0.160168
qa: -0.0456 -0.0429 -0.2842 -0.4009 -0.1463 -0.2040 -0.1654 -0.0967 -0.1519 -0.1258 -0.0957 -0.1055 -0.1151 -0.2866 0.3661 0.1727 0.2543 0.0173 -0.1614 -0.1589 -0.1309 -0.1953 -0.2238 -0.1081 0.1540 0.0800 0.0755 0.0758 0.0524 0.0850 0.0829 0.0499 0.0710 0.0096 0.0969 0.0537 0.0697 0.1357 0.1197 0.0947 0.0727 0.0881 0.1617 0.1436 0.1563 0.1585 0.1870 0.1602
va: 1.2577 2.4216 2.1220 2.0843 2.9478 2.9361 3.9065 3.8372 3.9138 3.8375 3.8845 3.8716 3.8867 3.9369 4.2499 3.8783 3.8225 3.5564 3.8407 3.9535 4.0426 3.8863 3.9026 3.8071 4.2109 1.0046 1.0102 1.0136 1.0141 1.0079 1.0024 1.0068 1.0122 1.0240 1.0157 1.0065 1.0106 1.0084 1.0213 1.0032 1.0018 1.0017 1.0061 1.0188 1.0055 0.9938 0.9676 0.9910
dispcorr: -0.028852030 hartree
energy: -1856.351166925482
dipole: 66.24021 -63.84006 2.40016 20.83254 -22.85066 -2.01811 5.18272 -5.12324 0.05948
magnitude: 3.13641 au
magnitude: 7.97212 debye
