program: Orca
programVersion: 5.0.2
elementType: Cl S O O N N C C C C C C C C C C C C C C C C C C C H H H H H H H H H H H H H H H H H H H H H H H
charge: 0
multiplicity: 1
keywords: wb97x-d3
keywords: def2-TZVPP
keywords: def2/J RIJCOSX
keywords: DEFGRID2
keywords: scfconv7
keywords: smallprint printgap noloewdin
keywords: NOSOSCF
formula: C19H23ClN2O2S
InChI: InChI=1/C19H23ClN2O2S/c1-2-3-4-5-6-10-13-25-19(23)24-16-14-17(20)21-22-18(16)15-11-8-7-9-12-15/h7-9,11-12,14H,2-6,10,13H2,1H3
48 atoms
Cl -4.917626 -2.664917 -2.566227
S  0.329322 -1.214125 2.546983
O  -1.678613 -1.273371 1.042187
O  0.196242 -0.674053 -0.050896
N  -3.422593 0.669701 -1.461021
N  -4.095268 -0.264484 -2.089444
C  4.559163 -0.169345 0.504074
C  6.030261 0.168747 0.290787
C  4.36175 -1.348295 1.451419
C  6.273341 1.394156 -0.585686
C  2.908764 -1.792045 1.611191
C  5.794923 1.247908 -2.025966
C  2.047638 -0.710659 2.240965
C  6.139048 2.457172 -2.882736
C  -0.352821 -1.001563 0.957116
C  -2.475542 -0.943914 -0.015235
C  -2.635445 0.386844 -0.437086
C  -1.921409 1.518162 0.184067
C  -1.249743 2.425338 -0.633697
C  -1.897382 1.692114 1.566517
C  -3.168789 -1.931696 -0.656883
C  -0.547552 3.480579 -0.074753
C  -1.195913 2.753026 2.121057
C  -0.514081 3.643151 1.303985
C  -3.98708 -1.508685 -1.69852
H  4.080132 -0.400198 -0.452653
H  4.048509 0.717969 0.892244
H  6.544125 -0.696174 -0.14319
H  6.497475 0.337002 1.266714
H  4.778417 -1.104723 2.434668
H  4.938604 -2.2018 1.082688
H  7.346024 1.613868 -0.592371
H  5.791604 2.267088 -0.130769
H  2.502834 -2.07408 0.636849
H  2.871286 -2.686275 2.23776
H  6.242195 0.350118 -2.465155
H  4.713329 1.089479 -2.049331
H  2.425201 -0.446954 3.23136
H  2.024141 0.208491 1.656445
H  7.217636 2.623471 -2.92303
H  5.682414 3.367373 -2.488254
H  5.788311 2.334826 -3.908842
H  -1.262208 2.292731 -1.707841
H  -2.440849 1.018021 2.216325
H  -3.079439 -2.972062 -0.374982
H  -0.019651 4.173572 -0.716906
H  -1.184242 2.882981 3.195282
H  0.040073 4.464406 1.739828
elementType: Cl S O N C H
totalener: -1856.33263876 hartree
nucrepener: 2417.61182550 hartree
electener: -4273.94446426 hartree
oneelecener: -7347.43293708 hartree
twoeener: 3073.48847282 hartree
cpcmener: -0.02521294 hartree
kineticenergy: 1850.60699120 hartree
xcener: -138.232678863663 hartree
chargesum: 0.0000000
charge: -0.045907 -0.043229 -0.285107 -0.380495 -0.140653 -0.196220 -0.118389 -0.126980 -0.130613 -0.128608 -0.163844 -0.077322 -0.099811 -0.284040 0.345973 0.177484 0.240773 0.026075 -0.178659 -0.174878 -0.138370 -0.172280 -0.177916 -0.119335 0.152307 0.066535 0.061340 0.062961 0.070279 0.070145 0.074953 0.069373 0.058063 0.086557 0.085910 0.055075 0.057867 0.132739 0.113368 0.078031 0.077711 0.089409 0.142028 0.159346 0.154161 0.157452 0.157050 0.159692
qa: -0.0459 -0.0432 -0.2851 -0.3805 -0.1407 -0.1962 -0.1184 -0.1270 -0.1306 -0.1286 -0.1638 -0.0773 -0.0998 -0.2840 0.3460 0.1775 0.2408 0.0261 -0.1787 -0.1749 -0.1384 -0.1723 -0.1779 -0.1193 0.1523 0.0665 0.0613 0.0630 0.0703 0.0701 0.0750 0.0694 0.0581 0.0866 0.0859 0.0551 0.0579 0.1327 0.1134 0.0780 0.0777 0.0894 0.1420 0.1593 0.1542 0.1575 0.1571 0.1597
va: 1.2565 2.4210 2.1164 2.1147 2.9480 2.9395 3.8594 3.9012 3.9096 3.8954 3.9081 3.8550 3.8730 3.9511 4.2893 3.8695 3.8407 3.5635 3.9819 3.8712 4.0446 3.9416 3.9148 3.8794 4.2097 1.0076 1.0082 1.0102 1.0100 1.0091 1.0111 1.0100 1.0090 1.0183 1.0188 1.0066 1.0071 1.0077 1.0218 1.0013 1.0004 1.0036 1.0169 1.0067 1.0068 0.9928 0.9939 0.9889
dispcorr: -0.022843680 hartree
energy: -1856.355482439739
dipole: 77.31891 -75.33007 1.98884 19.70123 -20.31609 -0.61485 5.93874 -3.71820 2.22053
magnitude: 3.04373 au
magnitude: 7.73655 debye
