program: Orca
programVersion: 5.0.2
elementType: Cl S O O N N C C C C C C C C C C C C C C C C C C C H H H H H H H H H H H H H H H H H H H H H H H
charge: 0
multiplicity: 1
keywords: wb97x-d3
keywords: def2-TZVPP
keywords: def2/J RIJCOSX
keywords: DEFGRID2
keywords: scfconv7
keywords: smallprint printgap noloewdin
keywords: NOSOSCF
formula: C19H23ClN2O2S
InChI: InChI=1/C19H23ClN2O2S/c1-2-3-4-5-6-10-13-25-19(23)24-16-14-17(20)21-22-18(16)15-11-8-7-9-12-15/h7-9,11-12,14H,2-6,10,13H2,1H3
48 atoms
Cl -5.550078 -0.859227 -2.239758
S  0.934149 -3.007212 0.681518
O  -1.337325 -1.991251 0.293791
O  0.291389 -0.923346 -0.832442
N  -3.132387 1.130798 -0.055692
N  -4.118866 0.774127 -0.842822
C  4.394433 0.148173 -0.415232
C  3.430085 1.328127 -0.344048
C  4.406457 -0.712596 0.847446
C  3.555475 2.31212 -1.504554
C  3.060528 -1.317686 1.241084
C  4.820478 3.161573 -1.473971
C  2.588204 -2.381263 0.262591
C  4.895332 4.144888 -2.632133
C  -0.0509 -1.787525 -0.083263
C  -2.266883 -1.068107 -0.091351
C  -2.21967 0.264238 0.349804
C  -1.170006 0.780829 1.24831
C  -0.520976 1.972043 0.928822
C  -0.824367 0.103292 2.416327
C  -3.293916 -1.462838 -0.902744
C  0.473285 2.468067 1.757122
C  0.165901 0.608469 3.246395
C  0.821683 1.785883 2.915816
C  -4.209656 -0.47144 -1.234657
H  5.41366 0.50875 -0.580771
H  4.152769 -0.461882 -1.291981
H  3.579131 1.865186 0.600426
H  2.403581 0.954532 -0.315322
H  4.758086 -0.100551 1.683455
H  5.142581 -1.514615 0.732765
H  2.687954 2.980303 -1.495115
H  3.501508 1.766986 -2.453822
H  3.145706 -1.76882 2.232377
H  2.308286 -0.530596 1.331244
H  4.85835 3.710267 -0.527347
H  5.707491 2.52199 -1.487925
H  2.571548 -2.037262 -0.771186
H  3.238045 -3.257695 0.295085
H  4.90834 3.627952 -3.5940
H  5.795211 4.759984 -2.579531
H  4.037474 4.821036 -2.63657
H  -0.780614 2.50432 0.022592
H  -1.339239 -0.805801 2.700333
H  -3.376686 -2.477761 -1.26755
H  0.980573 3.386909 1.492774
H  0.423603 0.078666 4.154187
H  1.60123 2.173363 3.558997
elementType: Cl S O N C H
totalener: -1856.33141866 hartree
nucrepener: 2511.30043902 hartree
electener: -4367.63185768 hartree
oneelecener: -7534.90327727 hartree
twoeener: 3167.27141959 hartree
cpcmener: -0.02470993 hartree
kineticenergy: 1850.60142164 hartree
xcener: -138.234045348045 hartree
chargesum: 0.0000000
charge: -0.046075 -0.046570 -0.285773 -0.377412 -0.141238 -0.196283 -0.140149 -0.089234 -0.155850 -0.128559 -0.090007 -0.077057 -0.108241 -0.282022 0.352402 0.168196 0.253453 0.028364 -0.158622 -0.163566 -0.136092 -0.211324 -0.191837 -0.086482 0.152145 0.078750 0.067350 0.059446 0.041446 0.078587 0.079325 0.069476 0.060198 0.098150 0.004606 0.054503 0.054631 0.115806 0.132695 0.078177 0.088318 0.077462 0.140767 0.155352 0.153573 0.155881 0.154332 0.159004
qa: -0.0461 -0.0466 -0.2858 -0.3774 -0.1412 -0.1963 -0.1401 -0.0892 -0.1559 -0.1286 -0.0900 -0.0771 -0.1082 -0.2820 0.3524 0.1682 0.2535 0.0284 -0.1586 -0.1636 -0.1361 -0.2113 -0.1918 -0.0865 0.1521 0.0787 0.0674 0.0594 0.0414 0.0786 0.0793 0.0695 0.0602 0.0981 0.0046 0.0545 0.0546 0.1158 0.1327 0.0782 0.0883 0.0775 0.1408 0.1554 0.1536 0.1559 0.1543 0.1590
va: 1.2561 2.4133 2.1194 2.1171 2.9517 2.9394 3.8824 3.8786 3.9479 3.9098 3.8876 3.8638 3.8729 3.9490 4.2718 3.8791 3.8120 3.5611 3.9256 3.8569 4.0453 3.9156 3.8956 3.8007 4.2072 1.0128 1.0056 1.0093 1.0122 1.0090 1.0077 1.0086 1.0085 1.0162 1.0285 1.0062 1.0091 1.0264 1.0086 1.0007 1.0041 1.0013 1.0180 1.0083 1.0070 0.9939 0.9948 0.9886
dispcorr: -0.027070851 hartree
energy: -1856.358489511802
dipole: 69.13003 -66.90604 2.22399 22.79305 -24.55880 -1.76575 2.81587 -1.88335 0.93252
magnitude: 2.98891 au
magnitude: 7.59722 debye
