program: Orca
programVersion: 5.0.2
elementType: Cl S O O N N C C C C C C C C C C C C C C C C C C C H H H H H H H H H H H H H H H H H H H H H H H
charge: 0
multiplicity: 1
keywords: wb97x-d3
keywords: def2-TZVPP
keywords: def2/J RIJCOSX
keywords: DEFGRID2
keywords: scfconv7
keywords: smallprint printgap noloewdin
keywords: NOSOSCF
formula: C19H23ClN2O2S
InChI: InChI=1/C19H23ClN2O2S/c1-2-3-4-5-6-10-13-25-19(23)24-16-14-17(20)21-22-18(16)15-11-8-7-9-12-15/h7-9,11-12,14H,2-6,10,13H2,1H3
48 atoms
Cl -5.420435 -0.695817 -1.961343
S  0.972783 -3.190452 0.542552
O  -1.137573 -1.858111 0.431815
O  0.405762 -1.106701 -1.023018
N  -2.846326 1.306716 0.016289
N  -3.880161 0.948341 -0.701572
C  3.693568 -0.13131 -0.683745
C  3.326106 1.334936 -0.501622
C  3.488858 -0.934335 0.596097
C  3.50458 2.174975 -1.759748
C  3.666568 -2.437269 0.430157
C  3.022435 3.616304 -1.613315
C  2.561561 -3.137479 -0.34669
C  3.781506 4.423128 -0.569184
C  0.078538 -1.868654 -0.164511
C  -2.044146 -0.913214 0.04072
C  -1.928616 0.436167 0.410934
C  -0.82266 0.991982 1.212124
C  -0.290562 0.317679 2.311607
C  -0.33299 2.258489 0.888474
C  -3.121245 -1.309229 -0.70295
C  0.720824 0.899658 3.062124
C  0.675809 2.834771 1.641963
C  1.208189 2.155446 2.729456
C  -4.024237 -0.308294 -1.038992
H  4.738802 -0.217723 -0.999664
H  3.097121 -0.548558 -1.500211
H  3.921066 1.751772 0.31763
H  2.281645 1.396376 -0.178613
H  2.49716 -0.724044 1.011416
H  4.197824 -0.581034 1.350193
H  2.955283 1.703011 -2.581041
H  4.558573 2.172409 -2.059963
H  4.605835 -2.642691 -0.09349
H  3.760501 -2.910741 1.410488
H  3.107443 4.118647 -2.58102
H  1.955243 3.615987 -1.368467
H  2.39382 -2.708382 -1.334367
H  2.815583 -4.187104 -0.499981
H  3.439614 5.459264 -0.545683
H  4.852908 4.437866 -0.782905
H  3.655298 4.019745 0.436755
H  -0.681212 -0.64404 2.616224
H  -0.740001 2.789155 0.037712
H  -3.253882 -2.337228 -1.012468
H  1.12095 0.370321 3.916984
H  1.049863 3.814956 1.375466
H  1.998323 2.60485 3.316915
elementType: Cl S O N C H
totalener: -1856.33143808 hartree
nucrepener: 2547.57801488 hartree
electener: -4403.90945296 hartree
oneelecener: -7607.68589485 hartree
twoeener: 3203.77644189 hartree
cpcmener: -0.02426856 hartree
kineticenergy: 1850.60312528 hartree
xcener: -138.235396324566 hartree
chargesum: -0.0000000
charge: -0.044692 -0.046805 -0.290256 -0.383768 -0.142075 -0.200251 -0.167301 -0.057586 -0.063938 -0.118231 -0.138857 -0.112337 -0.127865 -0.281833 0.355423 0.158817 0.259321 0.031581 -0.184694 -0.132836 -0.121948 -0.173967 -0.214629 -0.101961 0.152708 0.073393 0.066121 0.073323 0.001740 0.001227 0.088549 0.066927 0.061178 0.078349 0.087898 0.074260 0.053210 0.115544 0.135553 0.093310 0.085962 0.073381 0.153836 0.137747 0.152912 0.154999 0.160668 0.157887
qa: -0.0447 -0.0468 -0.2903 -0.3838 -0.1421 -0.2003 -0.1673 -0.0576 -0.0639 -0.1182 -0.1389 -0.1123 -0.1279 -0.2818 0.3554 0.1588 0.2593 0.0316 -0.1847 -0.1328 -0.1219 -0.1740 -0.2146 -0.1020 0.1527 0.0734 0.0661 0.0733 0.0017 0.0012 0.0885 0.0669 0.0612 0.0783 0.0879 0.0743 0.0532 0.1155 0.1356 0.0933 0.0860 0.0734 0.1538 0.1377 0.1529 0.1550 0.1607 0.1579
va: 1.2585 2.4071 2.1096 2.1091 2.9437 2.9387 3.9091 3.8539 3.8666 3.8970 3.9252 3.8853 3.8817 3.9217 4.2713 3.8861 3.8261 3.5651 3.8634 3.9004 4.0462 3.8857 3.9041 3.8330 4.2063 1.0145 1.0139 1.0046 1.0309 1.0301 1.0121 1.0102 1.0091 1.0107 1.0129 1.0099 1.0104 1.0219 1.0076 1.0036 1.0030 0.9988 1.0105 1.0254 1.0068 0.9950 0.9886 0.9899
dispcorr: -0.028251596 hartree
energy: -1856.359689680779
dipole: 62.02563 -59.93584 2.08980 20.30029 -22.30120 -2.00091 2.81737 -2.14024 0.67713
magnitude: 2.97144 au
magnitude: 7.55279 debye
