program: Orca
programVersion: 5.0.2
elementType: Cl S O O N N C C C C C C C C C C C C C C C C C C C H H H H H H H H H H H H H H H H H H H H H H H
charge: 0
multiplicity: 1
keywords: wb97x-d3
keywords: def2-TZVPP
keywords: def2/J RIJCOSX
keywords: DEFGRID2
keywords: scfconv7
keywords: smallprint printgap noloewdin
keywords: NOSOSCF
formula: C19H23ClN2O2S
InChI: InChI=1/C19H23ClN2O2S/c1-2-3-4-5-6-10-13-25-19(23)24-16-14-17(20)21-22-18(16)15-11-8-7-9-12-15/h7-9,11-12,14H,2-6,10,13H2,1H3
48 atoms
Cl -6.270648 -2.268596 -0.297541
S  0.437547 -0.05105 2.026398
O  -1.498929 -1.005367 0.739164
O  -1.496975 1.246424 0.751119
N  -3.447784 -0.63688 -2.284844
N  -4.603125 -1.131243 -1.908583
C  4.168767 1.470479 1.612209
C  5.421893 0.687331 1.240314
C  3.056899 1.339306 0.57789
C  6.556099 0.858586 2.242512
C  1.793873 2.125419 0.912598
C  7.800632 0.054273 1.888977
C  1.051758 1.656564 2.155409
C  8.941086 0.257016 2.874572
C  -0.995078 0.209959 1.066718
C  -2.540102 -1.05162 -0.141869
C  -2.412092 -0.596332 -1.46443
C  -1.158734 -0.03642 -2.004231
C  -1.192223 1.17368 -2.694342
C  0.055003 -0.702935 -1.844696
C  -3.729739 -1.587983 0.263672
C  -0.024246 1.717917 -3.204103
C  1.219931 -0.15869 -2.365046
C  1.184559 1.054611 -3.038132
C  -4.734513 -1.60807 -0.696892
H  4.422329 2.529265 1.734414
H  3.819495 1.128305 2.5918
H  5.766119 0.999362 0.248058
H  5.17064 -0.375327 1.152646
H  2.808297 0.282676 0.43381
H  3.429125 1.689938 -0.389269
H  6.208411 0.566872 3.239859
H  6.819053 1.919769 2.31349
H  2.051581 3.177169 1.074345
H  1.112548 2.11052 0.058282
H  7.543635 -1.008521 1.842109
H  8.136141 0.328349 0.883742
H  1.695643 1.64918 3.035739
H  0.210133 2.307123 2.391599
H  8.652081 -0.037221 3.885699
H  9.251146 1.303266 2.914673
H  9.817316 -0.332797 2.600723
H  -2.131427 1.697364 -2.818976
H  0.096078 -1.658822 -1.338023
H  -3.880439 -1.955995 1.269609
H  -0.058098 2.663234 -3.729833
H  2.156771 -0.686885 -2.245659
H  2.096344 1.480268 -3.436924
elementType: Cl S O N C H
totalener: -1856.33409587 hartree
nucrepener: 2422.84470148 hartree
electener: -4279.17879734 hartree
oneelecener: -7357.67236966 hartree
twoeener: 3078.49357232 hartree
cpcmener: -0.02511007 hartree
kineticenergy: 1850.60523860 hartree
xcener: -138.233229123283 hartree
chargesum: 0.0000000
charge: -0.046105 -0.043923 -0.285585 -0.375707 -0.140755 -0.196508 -0.096353 -0.113727 -0.145283 -0.107751 -0.145322 -0.079227 -0.141051 -0.280563 0.353167 0.169941 0.249840 0.032726 -0.177489 -0.174573 -0.136077 -0.159591 -0.186972 -0.124726 0.151680 0.063344 0.061295 0.057838 0.059546 0.056473 0.080606 0.055630 0.055528 0.089214 0.080007 0.054278 0.053204 0.135022 0.131478 0.076788 0.077191 0.089645 0.141077 0.155511 0.155016 0.156008 0.156966 0.158270
qa: -0.0461 -0.0439 -0.2856 -0.3757 -0.1408 -0.1965 -0.0964 -0.1137 -0.1453 -0.1078 -0.1453 -0.0792 -0.1411 -0.2806 0.3532 0.1699 0.2498 0.0327 -0.1775 -0.1746 -0.1361 -0.1596 -0.1870 -0.1247 0.1517 0.0633 0.0613 0.0578 0.0595 0.0565 0.0806 0.0556 0.0555 0.0892 0.0800 0.0543 0.0532 0.1350 0.1315 0.0768 0.0772 0.0896 0.1411 0.1555 0.1550 0.1560 0.1570 0.1583
va: 1.2565 2.4036 2.1181 2.1280 2.9501 2.9397 3.8803 3.8916 3.8703 3.8814 3.8824 3.8774 3.8861 3.9489 4.2811 3.8729 3.8179 3.5484 3.9825 3.8632 4.0449 3.9251 3.8828 3.8497 4.2102 1.0112 1.0104 1.0114 1.0087 1.0195 1.0118 1.0090 1.0088 1.0116 1.0192 1.0070 1.0070 1.0009 1.0225 1.0008 1.0010 1.0042 1.0173 1.0085 1.0063 0.9929 0.9943 0.9912
dispcorr: -0.024724476 hartree
energy: -1856.358820343857
dipole: 87.66822 -85.21833 2.44989 21.62706 -21.36780 0.25925 16.64012 -14.93485 1.70528
magnitude: 2.99619 au
magnitude: 7.61570 debye
