program: Orca
programVersion: 5.0.2
elementType: Cl S O O N N C C C C C C C C C C C C C C C C C C C H H H H H H H H H H H H H H H H H H H H H H H
charge: 0
multiplicity: 1
keywords: wb97x-d3
keywords: def2-TZVPP
keywords: def2/J RIJCOSX
keywords: DEFGRID2
keywords: scfconv7
keywords: smallprint printgap noloewdin
keywords: NOSOSCF
formula: C19H23ClN2O2S
InChI: InChI=1/C19H23ClN2O2S/c1-2-3-4-5-6-10-13-25-19(23)24-16-14-17(20)21-22-18(16)15-11-8-7-9-12-15/h7-9,11-12,14H,2-6,10,13H2,1H3
48 atoms
Cl -4.952772 1.060757 1.519374
S  1.603747 -1.991836 -0.271616
O  -0.808999 -1.330651 -0.083312
O  0.474694 0.34574 -0.858986
N  -3.487722 0.263635 -1.914705
N  -4.245415 0.700696 -0.937439
C  3.893713 1.150035 2.42282
C  3.105018 2.176141 3.228205
C  3.086987 0.58132 1.261264
C  3.883688 2.837309 4.361306
C  3.845373 -0.489457 0.491618
C  4.323425 1.887473 5.469444
C  3.111345 -1.068656 -0.706558
C  4.99737 2.613436 6.624396
C  0.367881 -0.775892 -0.464264
C  -1.955127 -0.641735 -0.359628
C  -2.373176 -0.407532 -1.679453
C  -1.597584 -0.841211 -2.856014
C  -1.103374 -2.14039 -2.962298
C  -1.356903 0.070983 -3.882219
C  -2.731238 -0.19653 0.672521
C  -0.367843 -2.514278 -4.077425
C  -0.616645 -0.305888 -4.991117
C  -0.11711 -1.598235 -5.089047
C  -3.893893 0.470391 0.30183
H  4.215906 0.328661 3.070774
H  4.810211 1.612697 2.039548
H  2.20744 1.699123 3.637891
H  2.745429 2.955484 2.548563
H  2.804068 1.391436 0.58215
H  2.153227 0.164263 1.653348
H  3.259755 3.622464 4.800722
H  4.762331 3.348022 3.951444
H  4.782064 -0.071082 0.108916
H  4.129525 -1.301235 1.167376
H  3.451842 1.33925 5.842408
H  5.007144 1.132798 5.07091
H  2.849109 -0.307959 -1.442206
H  3.737591 -1.801868 -1.21641
H  5.891181 3.146162 6.29251
H  5.303034 1.921769 7.411225
H  4.328006 3.348568 7.076499
H  -1.308483 -2.872869 -2.192084
H  -1.736663 1.081709 -3.802413
H  -2.452572 -0.344921 1.706978
H  0.007123 -3.526557 -4.155109
H  -0.425454 0.412156 -5.777973
H  0.463853 -1.891361 -5.954046
elementType: Cl S O N C H
totalener: -1856.33332400 hartree
nucrepener: 2404.47939127 hartree
electener: -4260.81271528 hartree
oneelecener: -7321.23644291 hartree
twoeener: 3060.42372763 hartree
cpcmener: -0.02542494 hartree
kineticenergy: 1850.60647261 hartree
xcener: -138.232274038030 hartree
chargesum: -0.0000000
charge: -0.045666 -0.045385 -0.288298 -0.380048 -0.140697 -0.195284 -0.121939 -0.114342 -0.116498 -0.138461 -0.117491 -0.076511 -0.116141 -0.284514 0.344933 0.167124 0.244307 0.038677 -0.185295 -0.181571 -0.130484 -0.171251 -0.169534 -0.122203 0.151785 0.061543 0.062826 0.060596 0.070172 0.069851 0.054685 0.069469 0.060168 0.078156 0.072359 0.056050 0.055995 0.116304 0.133333 0.078379 0.088865 0.078212 0.159333 0.141112 0.153626 0.156803 0.157170 0.159784
qa: -0.0457 -0.0454 -0.2883 -0.3800 -0.1407 -0.1953 -0.1219 -0.1143 -0.1165 -0.1385 -0.1175 -0.0765 -0.1161 -0.2845 0.3449 0.1671 0.2443 0.0387 -0.1853 -0.1816 -0.1305 -0.1713 -0.1695 -0.1222 0.1518 0.0615 0.0628 0.0606 0.0702 0.0699 0.0547 0.0695 0.0602 0.0782 0.0724 0.0560 0.0560 0.1163 0.1333 0.0784 0.0889 0.0782 0.1593 0.1411 0.1536 0.1568 0.1572 0.1598
va: 1.2572 2.4060 2.1106 2.1135 2.9489 2.9384 3.9042 3.8915 3.8892 3.9011 3.8958 3.8525 3.8799 3.9495 4.2911 3.8749 3.8336 3.5609 3.8839 3.9886 4.0480 3.9167 3.9366 3.8847 4.2097 1.0091 1.0102 1.0095 1.0110 1.0151 1.0176 1.0096 1.0079 1.0112 1.0149 1.0064 1.0077 1.0263 1.0074 1.0005 1.0038 1.0014 1.0069 1.0179 1.0065 0.9936 0.9928 0.9889
dispcorr: -0.022621762 hartree
energy: -1856.355945766068
dipole: 63.88577 -61.19652 2.68925 13.23619 -14.56404 -1.32786 28.57073 -27.95694 0.61379
magnitude: 3.06137 au
magnitude: 7.78139 debye
