program: Orca
programVersion: 5.0.2
elementType: Cl S O O N N C C C C C C C C C C C C C C C C C C C H H H H H H H H H H H H H H H H H H H H H H H
charge: 0
multiplicity: 1
keywords: wb97x-d3
keywords: def2-TZVPP
keywords: def2/J RIJCOSX
keywords: DEFGRID2
keywords: scfconv7
keywords: smallprint printgap noloewdin
keywords: NOSOSCF
formula: C19H23ClN2O2S
InChI: InChI=1/C19H23ClN2O2S/c1-2-3-4-5-6-10-13-25-19(23)24-16-14-17(20)21-22-18(16)15-11-8-7-9-12-15/h7-9,11-12,14H,2-6,10,13H2,1H3
48 atoms
Cl -6.142625 -1.748924 -1.294064
S  0.587436 -2.228837 1.867518
O  -1.649096 -1.488282 0.98573
O  -0.16813 -1.90486 -0.656107
N  -3.211053 0.694012 -1.437433
N  -4.351177 0.078376 -1.64156
C  4.671885 0.166382 -0.561827
C  4.92465 1.21714 0.51306
C  4.12884 -1.158497 -0.033782
C  5.537396 2.494077 -0.049114
C  2.759455 -1.025882 0.623911
C  5.842479 3.558262 1.001259
C  2.189251 -2.376351 1.021442
C  4.608321 4.14028 1.676006
C  -0.435056 -1.851934 0.506245
C  -2.553783 -0.973586 0.103035
C  -2.314591 0.227356 -0.584968
C  -1.07488 1.013097 -0.43146
C  -0.580934 1.348066 0.828445
C  -0.392451 1.437105 -1.570459
C  -3.738838 -1.626224 -0.089717
C  0.580858 2.098052 0.943145
C  0.773357 2.176705 -1.450344
C  1.261841 2.509818 -0.193705
C  -4.614457 -1.023341 -0.985951
H  5.60718 -0.026689 -1.096805
H  3.97602 0.568284 -1.306805
H  5.592076 0.801226 1.276954
H  3.987903 1.453493 1.02519
H  4.839709 -1.589474 0.679248
H  4.05995 -1.868358 -0.863747
H  4.86726 2.916039 -0.807278
H  6.463216 2.240257 -0.575629
H  2.823775 -0.396076 1.513533
H  2.077976 -0.523315 -0.0671
H  6.509417 3.136832 1.760366
H  6.401918 4.370639 0.528859
H  2.080186 -3.051908 0.172608
H  2.832718 -2.875808 1.748748
H  3.931327 4.587394 0.944306
H  4.880998 4.923716 2.385246
H  4.045099 3.388586 2.231323
H  -1.111715 1.051522 1.724307
H  -0.76639 1.174726 -2.551803
H  -3.971245 -2.553424 0.416746
H  0.953043 2.36237 1.924649
H  1.302308 2.493301 -2.339977
H  2.170582 3.091359 -0.1016
elementType: Cl S O N C H
totalener: -1856.33261071 hartree
nucrepener: 2490.35697763 hartree
electener: -4346.68958835 hartree
oneelecener: -7492.64108923 hartree
twoeener: 3145.95150089 hartree
cpcmener: -0.02499987 hartree
kineticenergy: 1850.60721739 hartree
xcener: -138.234549863628 hartree
chargesum: 0.0000000
charge: -0.046029 -0.044149 -0.284897 -0.373919 -0.140780 -0.196542 -0.122301 -0.122783 -0.140758 -0.130156 -0.115079 -0.092787 -0.114519 -0.296077 0.344421 0.169871 0.246805 0.015129 -0.147905 -0.150649 -0.138521 -0.200346 -0.183095 -0.118648 0.152795 0.078417 0.062726 0.073873 0.042122 0.071287 0.080041 0.063636 0.073521 0.077756 0.049591 0.052907 0.069722 0.118698 0.130087 0.080169 0.099882 0.081180 0.156386 0.140880 0.154438 0.152236 0.153797 0.167569
qa: -0.0460 -0.0441 -0.2849 -0.3739 -0.1408 -0.1965 -0.1223 -0.1228 -0.1408 -0.1302 -0.1151 -0.0928 -0.1145 -0.2961 0.3444 0.1699 0.2468 0.0151 -0.1479 -0.1506 -0.1385 -0.2003 -0.1831 -0.1186 0.1528 0.0784 0.0627 0.0739 0.0421 0.0713 0.0800 0.0636 0.0735 0.0778 0.0496 0.0529 0.0697 0.1187 0.1301 0.0802 0.0999 0.0812 0.1564 0.1409 0.1544 0.1522 0.1538 0.1676
va: 1.2563 2.4091 2.1193 2.1276 2.9501 2.9386 3.8774 3.8561 3.9260 3.8804 3.8623 3.8804 3.9147 3.9345 4.2891 3.8775 3.8221 3.5534 3.8513 3.9640 4.0452 3.8916 3.9422 3.7957 4.2095 1.0135 1.0114 1.0132 1.0030 1.0092 1.0105 1.0077 1.0133 1.0104 1.0235 1.0088 1.0073 1.0244 1.0081 0.9990 1.0060 0.9962 1.0069 1.0160 1.0064 0.9979 0.9969 0.9750
dispcorr: -0.027440171 hartree
energy: -1856.360050882101
dipole: 77.20147 -74.95004 2.25143 26.59804 -27.45429 -0.85625 9.75764 -7.99056 1.76708
magnitude: 2.98742 au
magnitude: 7.59342 debye
