program: Orca
programVersion: 5.0.2
elementType: Cl S O O N N C C C C C C C C C C C C C C C C C C C H H H H H H H H H H H H H H H H H H H H H H H
charge: 0
multiplicity: 1
keywords: wb97x-d3
keywords: def2-TZVPP
keywords: def2/J RIJCOSX
keywords: DEFGRID2
keywords: scfconv7
keywords: smallprint printgap noloewdin
keywords: NOSOSCF
formula: C19H23ClN2O2S
InChI: InChI=1/C19H23ClN2O2S/c1-2-3-4-5-6-10-13-25-19(23)24-16-14-17(20)21-22-18(16)15-11-8-7-9-12-15/h7-9,11-12,14H,2-6,10,13H2,1H3
48 atoms
Cl -6.3447 -1.729444 -0.728305
S  0.953371 -2.668718 0.393379
O  -1.307371 -1.972729 -0.453923
O  -0.92199 -1.268101 1.6479
N  -3.538619 0.858199 -0.696884
N  -4.708765 0.266636 -0.72151
C  4.003714 0.820356 1.258165
C  4.995637 1.225935 0.176954
C  3.416996 -0.56841 1.046588
C  5.562933 2.624456 0.381049
C  2.353629 -0.91108 2.079996
C  6.56165 3.036738 -0.692197
C  1.803158 -2.322011 1.964363
C  7.12751 4.431243 -0.469785
C  -0.556668 -1.84329 0.667216
C  -2.453206 -1.234986 -0.535393
C  -2.415072 0.165837 -0.621277
C  -1.1598 0.939697 -0.606049
C  -0.089156 0.598006 -1.431022
C  -1.054519 2.049688 0.230835
C  -3.661842 -1.870949 -0.565007
C  1.069523 1.360704 -1.417438
C  0.108594 2.802811 0.247347
C  1.171964 2.461602 -0.578388
C  -4.771524 -1.039372 -0.673419
H  3.190199 1.552877 1.295288
H  4.49284 0.863718 2.23725
H  4.506672 1.171611 -0.802365
H  5.816416 0.500874 0.1445
H  4.216957 -1.315897 1.081066
H  2.985868 -0.62758 0.042178
H  6.043552 2.681199 1.364106
H  4.740555 3.348559 0.406273
H  2.778167 -0.822584 3.085261
H  1.538937 -0.184064 2.030012
H  7.380862 2.311434 -0.722691
H  6.079842 2.989812 -1.673865
H  2.609958 -3.057142 1.995559
H  1.122912 -2.564298 2.780892
H  6.33818 5.185886 -0.468627
H  7.840287 4.705373 -1.249178
H  7.647425 4.501162 0.488077
H  -0.163215 -0.241023 -2.111036
H  -1.88119 2.316786 0.876807
H  -3.746595 -2.947207 -0.497215
H  1.88955 1.097314 -2.072683
H  0.183964 3.659368 0.904714
H  2.076883 3.055781 -0.571582
elementType: Cl S O N C H
totalener: -1856.33489053 hartree
nucrepener: 2460.57797658 hartree
electener: -4316.91286711 hartree
oneelecener: -7433.17272900 hartree
twoeener: 3116.25986190 hartree
cpcmener: -0.02495088 hartree
kineticenergy: 1850.61600572 hartree
xcener: -138.234680565610 hartree
chargesum: 0.0000000
charge: -0.045616 -0.046112 -0.287984 -0.379005 -0.142250 -0.194847 -0.145972 -0.118016 -0.132948 -0.110147 -0.124044 -0.078639 -0.132928 -0.280885 0.352133 0.165362 0.250775 0.033940 -0.173949 -0.168547 -0.130991 -0.198451 -0.169257 -0.126627 0.151014 0.060933 0.082251 0.056645 0.068500 0.084529 0.053827 0.062103 0.052463 0.088134 0.072601 0.054072 0.053836 0.128961 0.132841 0.077203 0.089831 0.077393 0.155388 0.141737 0.153980 0.160246 0.154846 0.171671
qa: -0.0456 -0.0461 -0.2880 -0.3790 -0.1423 -0.1948 -0.1460 -0.1180 -0.1329 -0.1101 -0.1240 -0.0786 -0.1329 -0.2809 0.3521 0.1654 0.2508 0.0339 -0.1739 -0.1685 -0.1310 -0.1985 -0.1693 -0.1266 0.1510 0.0609 0.0823 0.0566 0.0685 0.0845 0.0538 0.0621 0.0525 0.0881 0.0726 0.0541 0.0538 0.1290 0.1328 0.0772 0.0898 0.0774 0.1554 0.1417 0.1540 0.1602 0.1548 0.1717
va: 1.2570 2.4029 2.1133 2.1233 2.9519 2.9388 3.8824 3.8718 3.8480 3.8745 3.8585 3.8772 3.8990 3.9486 4.2819 3.8739 3.8242 3.5459 3.8706 3.9840 4.0483 3.8683 3.9374 3.8199 4.2098 1.0077 1.0119 1.0097 1.0125 1.0126 1.0216 1.0097 1.0092 1.0107 1.0183 1.0074 1.0067 1.0079 1.0193 1.0008 1.0043 1.0008 1.0085 1.0171 1.0062 0.9945 0.9949 0.9796
dispcorr: -0.025939928 hartree
energy: -1856.360830459421
dipole: 81.44808 -78.81537 2.63270 28.88709 -30.29098 -1.40389 8.99798 -8.69466 0.30332
magnitude: 2.99901 au
magnitude: 7.62287 debye
