program: Gaussian 09
title: 000059676
version: EM64L-G09RevD.01
frameworkgroup: C1[X(C10H10BrNO)]
method: RPBEPBE
basis: SDD
operation: Freq
keyword: #p
keyword: freq=noraman
keyword: PBEPBE/SDD
title: #p freq=noraman PBEPBE/SDD
converged: YES YES NO NO
title: Mulliken charges:
elementType: Br O N C C C C C C C C C C H H H H H H H H H H
charge: -0.038140 -0.284058 -0.618700 0.401309 0.159400 -0.687613 -0.380974 -0.382001 -0.227885 -0.241195 0.133455 0.086172 -0.569857 0.243169 0.286250 0.240455 0.250059 0.233269 0.233750 0.331056 0.332422 0.240308 0.259347
chargesum: 0.00000
title: Mulliken charges with hydrogens summed into heavy atoms:
elementType: Br O N C C C C C C C C C C
charge: -0.038140 -0.284058 0.044778 0.401309 0.159400 -0.158194 -0.140519 -0.131942 0.005385 -0.007445 0.133455 0.086172 -0.070202
polarizability: 1.26257691e+02 -2.12684033e+00 1.63490658e+02 -1.24653436e+01 2.33314482e+00 9.25362819e+01
1716.lowfreq: -7.2745 -5.6262 0.0006 0.0007 0.0009 5.5287 26.1041 52.3588 68.2086
frequency: 26.0967 52.3488 68.2062 101.2550 119.7041 178.2208 225.2469 268.6393 329.2182 355.2446 369.3330 401.6521 438.8003 455.4351 509.6842 525.5364 550.3721 591.2068 597.9331 613.7993 680.9709 709.7307 715.7679 763.5410 789.4030 834.2720 889.4063 917.9865 927.9040 938.3256 963.2634 996.3369 1043.9789 1050.9600 1079.7156 1105.7790 1145.2499 1177.9523 1204.1204 1212.5948 1289.4910 1311.0391 1343.4485 1378.5240 1401.5035 1430.5853 1444.1489 1481.9829 1572.8195 1585.9305 1606.5302 1627.1819 1645.2579 3003.6456 3068.6901 3102.4741 3125.7406 3132.1830 3146.3228 3165.6053 3221.1646 3517.2106 3673.1177
redmass: 6.2909 6.9878 4.8794 5.6053 4.4198 6.4420 4.5405 4.1284 3.4019 5.4520 2.9435 3.0473 5.4855 3.3390 2.8186 1.1475 3.2557 1.3299 4.2297 3.5940 1.4236 2.6315 3.3117 1.7666 2.7013 3.3314 1.5369 1.7285 1.3849 2.1070 1.3985 1.3404 2.3505 2.4680 2.1940 2.0935 1.8441 1.0857 2.2923 1.3127 1.3476 1.4035 3.9185 7.0602 1.1504 2.0991 1.1429 2.5557 3.2363 3.2465 4.6237 2.2833 5.9504 1.0593 1.1012 1.0627 1.0856 1.0893 1.0941 1.1009 1.1148 1.0448 1.1044
irintensity: 1.6064 0.5892 7.8438 7.4476 1.3147 6.0729 0.7556 3.6258 1.0635 5.7900 3.2122 5.2533 10.6329 11.2171 39.3768 136.7471 7.6537 85.6437 20.7625 12.2446 1.0911 45.7526 17.9301 39.6195 14.6225 9.2505 1.7044 2.8601 70.7332 9.0731 1.9876 0.0399 4.1374 2.0266 11.3741 70.1562 9.6535 1.0866 2.0904 31.8009 3.0792 3.0278 184.9167 5.8277 6.8489 4.1658 50.3882 7.5609 74.0888 13.0241 41.7891 235.3717 42.9202 20.6718 2.4261 0.5876 3.3222 3.3863 24.1811 24.6269 2.7857 43.3882 26.2868
temp: 298.150 k
press: 1.00000 atm
elementType: 35 8 7 6 6 6 6 6 6 6 6 6 6 1 1 1 1 1 1 1 1 1 1
symmnumber: 1
zpe: 461757.3 jmol-1
zpe.correction: 0.175874 hartree
zpe.thermalcorrener: 0.188364 hartree
zpe.thermalcorrenthalpy: 0.189308 hartree
zpe.thermalcorrgfe: 0.135044 hartree
zpe.sumelectzpe: -529.560259 hartree
zpe.sumelectthermal: -529.547770 hartree
zpe.sumelectthermalent: -529.546825 hartree
zpe.sumelectthermalfe: -529.601089 hartree
dipole: 2.2870 -0.6906 -2.4457
dipole: 3.4189
quadrupole: -84.4338 -77.9142 -82.7710
quadrupole: -3.0796 -11.1617 -9.0781
quadrupole: -2.7274 3.7921 -1.0647 -3.0796 -11.1617 -9.0781
hfenergy: -529.7361331 hartree
pointgroup: C01 [X(C10H10Br1N1O1)]
dipole: -0.9230016 0.2615273 0.942836 debye
dipolederiv: -0.1553807 0.0801741 -0.067884 0.1171013 -0.5477641 0.234476 -0.1528899 0.2781679 -0.2342178 -0.6069057 -0.1049584 0.2383147 -0.1724473 -0.7100599 0.1884949 0.2036749 -0.0546267 -0.8264221 -0.5749534 0.1618371 -0.0496513 0.1688864 -0.6434019 -0.4202368 -0.0084855 -0.4016591 -0.8773618 0.3253324 -0.0575138 -0.0876223 0.0787285 0.0120683 -0.0221781 -0.1234395 0.0655607 -0.040332 -0.1568245 -0.1750568 0.0081407 -0.1307373 -0.2888643 -0.0352532 0.0274329 -0.0101904 -0.0703591 -0.0433531 -0.0638869 -0.0351432 0.0296426 -0.1438456 0.1802273 -0.1431531 0.1640359 0.0109073 -0.191485 -0.0774282 -0.0312748 -0.1166456 0.0415974 0.1108401 -0.0123643 0.0499295 -0.0832541 -0.0345195 0.0327351 -0.0311075 -0.0285852 0.0458913 0.0632583 -0.0807552 -0.0458509 -0.1325446 0.0045367 0.0767015 -0.0455837 0.0814458 0.0915141 0.0428593 -0.0410145 0.0427005 -0.0914598 0.0496181 0.0167758 -0.1079537 0.0173971 -0.139017 -0.0114055 -0.0931757 -0.001414 -0.1044559 0.558074 0.3329919 -0.2675094 0.3280834 1.1096373 0.2703356 -0.2574035 0.4696236 1.3497947 0.1871866 0.0304322 0.2382575 -0.099526 0.9675392 -0.4876359 0.5145308 -0.5344708 0.2059659 -0.3323875 -0.0411974 0.1279392 -0.0593467 -0.4081949 0.0017494 0.0607152 0.0450992 -0.2231736 0.0263101 -0.0201332 -0.0205012 0.0366315 -0.0317893 -0.1507033 -0.0081504 -0.080634 0.0363593 0.0194275 0.0066924 -0.0270083 -0.0816629 0.1004122 0.0928937 -0.0328262 0.0726074 0.0764397 0.0658421 0.0742409 0.0740072 0.0530605 -0.0176319 -0.072573 0.0538537 -0.0813865 0.0783 0.0693384 0.0441048 0.0425767 0.0667065 -0.0324868 -0.0833592 0.0658667 -0.0701137 0.0914878 0.0350435 -0.0919325 0.012643 -0.1133188 -0.0546342 -0.0286121 0.0255726 -0.0289264 0.1357338 -0.0819682 -0.0298784 0.0978695 -0.0191568 0.0856619 -0.0162141 0.1067618 -0.0053974 0.1100324 0.2964568 -0.0815427 0.0495092 -0.0743804 0.2174336 0.0367467 0.0615841 0.0559743 0.1942218 0.3058673 -0.0794929 0.0509725 -0.0845328 0.2195234 -0.0028261 0.0449045 -0.0010171 0.1897949 0.0457248 -0.0025985 -0.1094381 -0.0103506 0.1201114 0.0294899 -0.1448107 0.0260737 0.0926532 0.1890195 -0.0310659 -0.0595526 0.0130066 0.0063001 0.0796263 -0.0664284 0.0459143 0.1118899 unknown
polarizability: 139.076063|17.4430968|151.1940068|-11.2535904|4.0986919|92.0145609 unknown
InChI: InChI=1S/C10H10BrNO/c1-7(11)6-8-4-2-3-5-9(8)10(12)13/h2-5H,1,6,12H2
charge 0 multiplicity 1
23 atoms
Br 2.624808 -2.276052 0.726339
O  0.644607 2.354011 -0.792642
N  -0.095627 2.504162 1.396294
C  -0.135314 -0.603907 -0.580614
C  -0.70039 0.508753 0.112704
C  1.247846 -0.54126 -1.230933
C  -0.881522 -1.804339 -0.651353
C  -1.989244 0.391293 0.697375
C  -2.160752 -1.917916 -0.063166
C  -2.721037 -0.812109 0.612624
C  0.010693 1.841582 0.183013
C  2.404303 -0.550563 -0.248935
C  3.27193 0.453841 0.001843
H  1.356849 -1.396968 -1.922106
H  1.333056 0.392784 -1.813819
H  -0.444427 -2.665414 -1.169734
H  -2.440734 1.262877 1.185671
H  -2.715573 -2.859502 -0.137137
H  -3.718447 -0.881207 1.059832
H  -0.484292 2.053743 2.222823
H  0.343018 3.420747 1.484417
H  4.095705 0.361751 0.714238
H  3.136243 1.408194 -0.521233
