program: Orca
programVersion: 5.0.2
elementType: Cl S O O N N C C C C C C C C C C C C C C C C C C C H H H H H H H H H H H H H H H H H H H H H H H
charge: 0
multiplicity: 1
keywords: wb97x-d3
keywords: def2-TZVPP
keywords: def2/J RIJCOSX
keywords: DEFGRID2
keywords: scfconv7
keywords: smallprint printgap noloewdin
keywords: NOSOSCF
formula: C19H23ClN2O2S
InChI: InChI=1/C19H23ClN2O2S/c1-2-3-4-5-6-10-13-25-19(23)24-16-14-17(20)21-22-18(16)15-11-8-7-9-12-15/h7-9,11-12,14H,2-6,10,13H2,1H3
48 atoms
Cl -6.31392 -1.933683 -0.756516
S  0.89519 -2.126379 1.072933
O  -1.313489 -1.800102 -0.082705
O  -1.129668 -0.563832 1.787747
N  -3.627594 0.745648 -1.189184
N  -4.768275 0.09908 -1.139945
C  3.700619 1.666373 1.223932
C  4.764872 1.894949 0.155993
C  3.23133 0.221747 1.350642
C  6.099041 1.215587 0.441331
C  2.079997 0.085876 2.336096
C  7.173781 1.557478 -0.582895
C  1.599445 -1.338217 2.553574
C  8.513236 0.904125 -0.280763
C  -0.661459 -1.345587 1.015714
C  -2.475445 -1.172712 -0.428758
C  -2.485647 0.160762 -0.867357
C  -1.2664 0.983732 -0.978297
C  -0.120492 0.494917 -1.604365
C  -1.271236 2.284698 -0.47778
C  -3.651051 -1.867036 -0.378953
C  1.00308 1.299412 -1.727521
C  -0.144062 3.082109 -0.597436
C  0.994941 2.59223 -1.223338
C  -4.78083 -1.156334 -0.769173
H  2.833681 2.295742 0.998851
H  4.078613 2.012944 2.192341
H  4.93273 2.972354 0.054395
H  4.383702 1.557954 -0.815223
H  4.05716 -0.421409 1.670176
H  2.920856 -0.142254 0.365188
H  5.970273 0.128809 0.474072
H  6.445628 1.508662 1.439201
H  2.393869 0.461056 3.31561
H  1.246521 0.719533 2.023477
H  6.835963 1.254437 -1.579088
H  7.30045 2.644001 -0.625658
H  2.429184 -1.991824 2.831794
H  0.86461 -1.402357 3.356182
H  8.897615 1.215622 0.692865
H  9.265487 1.165873 -1.026804
H  8.432873 -0.184982 -0.266679
H  -0.106242 -0.499746 -2.030692
H  -2.155134 2.670536 0.013818
H  -3.6967 -2.89598 -0.048621
H  1.88244 0.916413 -2.229043
H  -0.155599 4.089656 -0.202453
H  1.872039 3.218981 -1.321836
elementType: Cl S O N C H
totalener: -1856.33386633 hartree
nucrepener: 2457.94710568 hartree
electener: -4314.28097201 hartree
oneelecener: -7427.92290725 hartree
twoeener: 3113.64193524 hartree
cpcmener: -0.02488758 hartree
kineticenergy: 1850.60498430 hartree
xcener: -138.233323605794 hartree
chargesum: -0.0000000
charge: -0.045842 -0.045296 -0.288281 -0.379251 -0.142894 -0.195534 -0.150148 -0.133625 -0.140138 -0.102542 -0.129840 -0.084909 -0.127077 -0.276385 0.351466 0.163114 0.254710 0.045742 -0.187540 -0.180831 -0.131016 -0.180426 -0.154286 -0.145318 0.150986 0.077987 0.082296 0.072272 0.058079 0.085941 0.055998 0.058297 0.056085 0.089367 0.072225 0.054248 0.053635 0.127761 0.132511 0.076941 0.089143 0.076549 0.155734 0.140428 0.154744 0.160138 0.156413 0.168371
qa: -0.0458 -0.0453 -0.2883 -0.3793 -0.1429 -0.1955 -0.1501 -0.1336 -0.1401 -0.1025 -0.1298 -0.0849 -0.1271 -0.2764 0.3515 0.1631 0.2547 0.0457 -0.1875 -0.1808 -0.1310 -0.1804 -0.1543 -0.1453 0.1510 0.0780 0.0823 0.0723 0.0581 0.0859 0.0560 0.0583 0.0561 0.0894 0.0722 0.0542 0.0536 0.1278 0.1325 0.0769 0.0891 0.0765 0.1557 0.1404 0.1547 0.1601 0.1564 0.1684
va: 1.2569 2.4055 2.1124 2.1233 2.9523 2.9397 3.8897 3.8974 3.8354 3.8661 3.8617 3.8857 3.8981 3.9470 4.2827 3.8763 3.8190 3.5363 3.8792 3.9974 4.0456 3.8541 3.9264 3.8403 4.2086 1.0091 1.0109 1.0118 1.0104 1.0109 1.0195 1.0085 1.0084 1.0099 1.0196 1.0060 1.0082 1.0087 1.0188 1.0010 1.0045 1.0014 1.0089 1.0184 1.0059 0.9944 0.9936 0.9845
dispcorr: -0.025818069 hartree
energy: -1856.359684401088
dipole: 84.41954 -81.77265 2.64690 22.73000 -23.81319 -1.08320 9.62424 -8.81461 0.80964
magnitude: 2.97235 au
magnitude: 7.55513 debye
