program: Orca
programVersion: 5.0.2
elementType: Cl S O O N N C C C C C C C C C C C C C C C C C C C H H H H H H H H H H H H H H H H H H H H H H H
charge: 0
multiplicity: 1
keywords: wb97x-d3
keywords: def2-TZVPP
keywords: def2/J RIJCOSX
keywords: DEFGRID2
keywords: scfconv7
keywords: smallprint printgap noloewdin
keywords: NOSOSCF
formula: C19H23ClN2O2S
InChI: InChI=1/C19H23ClN2O2S/c1-2-3-4-5-6-10-13-25-19(23)24-16-14-17(20)21-22-18(16)15-11-8-7-9-12-15/h7-9,11-12,14H,2-6,10,13H2,1H3
48 atoms
Cl -6.114468 -0.630172 0.724638
S  0.893253 -3.021718 0.395071
O  -1.330022 -1.977721 -0.081863
O  -0.022848 -0.659904 1.19801
N  -3.120573 1.049611 -0.943647
N  -4.309413 0.788569 -0.457369
C  4.492826 0.083699 1.723969
C  4.354999 1.430878 1.021632
C  4.566375 -1.098213 0.75927
C  4.265826 2.596846 2.000541
C  3.224152 -1.523848 0.16431
C  4.410654 3.973631 1.358898
C  2.410587 -2.358147 1.141351
C  3.349476 4.289221 0.314944
C  -0.192117 -1.670547 0.586695
C  -2.315256 -1.041047 -0.191297
C  -2.124056 0.183807 -0.852089
C  -0.839463 0.604412 -1.441099
C  -0.088413 -0.249048 -2.247283
C  -0.375923 1.895037 -1.191734
C  -3.549986 -1.333128 0.318398
C  1.118816 0.18122 -2.778676
C  0.829294 2.320077 -1.725736
C  1.583596 1.462129 -2.515344
C  -4.522635 -0.357756 0.136326
H  3.667044 -0.052871 2.430802
H  5.402611 0.102714 2.331605
H  3.477542 1.42414 0.367077
H  5.221514 1.573319 0.365082
H  5.016404 -1.960291 1.261527
H  5.248685 -0.843791 -0.057258
H  5.048136 2.483941 2.758557
H  3.314137 2.543902 2.540578
H  2.648147 -0.649512 -0.150283
H  3.398545 -2.117184 -0.73612
H  4.377255 4.733508 2.144726
H  5.402722 4.056058 0.903323
H  2.969026 -3.245831 1.445238
H  2.148112 -1.819978 2.052275
H  3.421013 3.627731 -0.549571
H  3.449825 5.311581 -0.053692
H  2.34335 4.186891 0.72771
H  -0.448228 -1.241674 -2.48657
H  -0.95369 2.562901 -0.565789
H  -3.750493 -2.261982 0.834931
H  1.694782 -0.487551 -3.404761
H  1.180148 3.323288 -1.5230
H  2.527984 1.792923 -2.928083
elementType: Cl S O N C H
totalener: -1856.33052578 hartree
nucrepener: 2497.47101118 hartree
electener: -4353.80153696 hartree
oneelecener: -7507.14431235 hartree
twoeener: 3153.34277538 hartree
cpcmener: -0.02498742 hartree
kineticenergy: 1850.60833071 hartree
xcener: -138.233923802875 hartree
chargesum: 0.0000000
charge: -0.045559 -0.045875 -0.283070 -0.375716 -0.140474 -0.197549 -0.133066 -0.086441 -0.139292 -0.120060 -0.107845 -0.108771 -0.110720 -0.280393 0.344615 0.176615 0.244554 0.021767 -0.164734 -0.157909 -0.137691 -0.189119 -0.189594 -0.121382 0.151824 0.064427 0.073378 0.034842 0.059088 0.081195 0.075208 0.064800 0.065866 0.034979 0.090363 0.067925 0.054529 0.126945 0.115244 0.070363 0.096957 0.082554 0.160793 0.137624 0.153168 0.154128 0.173639 0.157871
qa: -0.0456 -0.0459 -0.2831 -0.3757 -0.1405 -0.1975 -0.1331 -0.0864 -0.1393 -0.1201 -0.1078 -0.1088 -0.1107 -0.2804 0.3446 0.1766 0.2446 0.0218 -0.1647 -0.1579 -0.1377 -0.1891 -0.1896 -0.1214 0.1518 0.0644 0.0734 0.0348 0.0591 0.0812 0.0752 0.0648 0.0659 0.0350 0.0904 0.0679 0.0545 0.1269 0.1152 0.0704 0.0970 0.0826 0.1608 0.1376 0.1532 0.1541 0.1736 0.1579
va: 1.2569 2.4146 2.1192 2.1234 2.9461 2.9395 3.9044 3.8597 3.9341 3.8790 3.9040 3.9095 3.8799 3.9332 4.2868 3.8761 3.8287 3.5624 3.8449 3.9832 4.0409 3.8934 3.9189 3.8509 4.2095 1.0080 1.0104 1.0059 1.0103 1.0062 1.0095 1.0119 1.0082 1.0232 1.0153 1.0086 1.0082 1.0116 1.0241 0.9974 1.0060 0.9971 1.0059 1.0218 1.0075 0.9954 0.9778 0.9917
dispcorr: -0.026353949 hartree
energy: -1856.356879731748
dipole: 70.74671 -68.33667 2.41005 22.50441 -24.31949 -1.81508 6.07913 -5.85729 0.22184
magnitude: 3.02524 au
magnitude: 7.68954 debye
